program: Gaussian 09
title: 000043574
version: EM64L-G09RevD.01
frameworkgroup: C1[X(C19H17NO4)]
method: RPBEPBE
basis: SDD
operation: Freq
keyword: #p
keyword: freq=noraman
keyword: PBEPBE/SDD
title: #p freq=noraman PBEPBE/SDD
converged: YES YES NO NO
title: Mulliken charges:
elementType: O O O O N C C C C C C C C C C C C C C C C C C C H H H H H H H H H H H H H H H H H
charge: -0.271076 -0.265851 -0.296495 -0.296547 0.011921 -0.718682 0.426674 0.270835 0.557275 0.390271 -0.571798 -0.546250 0.206169 -0.374110 -0.555790 0.152411 -0.570894 0.207808 -0.329472 0.203119 -0.544215 -0.201597 -0.529855 -0.528851 0.235153 0.230926 0.258900 0.275796 0.248345 0.253784 0.258104 0.250693 0.260577 0.237589 0.235155 0.232121 0.255375 0.228945 0.225459 0.232519 0.255558
chargesum: 0.00000
title: Mulliken charges with hydrogens summed into heavy atoms:
elementType: O O O O N C C C C C C C C C C C C C C C C C C C
charge: -0.271076 -0.265851 -0.296495 -0.296547 0.011921 -0.252602 0.426674 0.270835 0.557275 0.390271 -0.312898 -0.270454 0.206169 -0.125765 -0.302006 0.152411 -0.312790 0.207808 -0.078779 0.203119 -0.283638 0.271147 0.186586 0.184686
polarizability: 2.66477447e+02 -1.47515745e+01 2.70224591e+02 -1.36770720e+01 7.92309266e+00 1.55930262e+02
1716.lowfreq: -62.8885 -0.0009 -0.0006 -0.0004 0.8017 2.2479 8.7688 17.2529 21.0630
frequency: -62.8797 17.0223 20.9761 34.9691 68.9304 74.3733 107.8767 117.4762 132.9388 161.1348 164.2016 169.3619 194.4193 213.5409 219.0019 233.4308 255.6578 281.9191 311.3736 329.9209 353.1337 369.4754 407.2384 416.5127 419.0070 443.2242 486.1325 501.3025 543.8270 573.6599 581.1045 585.4492 593.3616 656.0334 664.3717 679.7468 703.1664 716.0857 737.7059 740.2393 748.6305 777.2126 778.9295 817.3445 840.7616 849.9013 866.7867 874.1759 890.0428 899.8519 913.8108 916.6570 934.2956 943.1955 949.9407 954.7875 977.3835 1037.2215 1058.3363 1063.9353 1099.2828 1112.8698 1115.0670 1117.9365 1119.0466 1131.5317 1149.5074 1157.1029 1170.2763 1185.0681 1201.7020 1232.3548 1248.8458 1261.0194 1269.1942 1273.8752 1305.1563 1324.7427 1364.7075 1366.8105 1393.4066 1398.7863 1405.5220 1423.9445 1435.9757 1439.8345 1453.7888 1458.7548 1462.9844 1466.9773 1477.3464 1477.5217 1486.2906 1487.1153 1489.0382 1552.3663 1562.0075 1610.8070 1627.1573 1630.8503 2972.4736 2975.7030 2978.3390 3010.5279 3019.6101 3074.5585 3077.5695 3088.2986 3109.4509 3122.1768 3125.9929 3126.7183 3144.7318 3148.7799 3157.3425 3169.8668 3179.7681
redmass: 2.3021 6.0257 5.4010 4.8929 3.8543 4.8025 3.5550 4.2132 4.2096 1.1399 1.6169 1.7943 4.2302 4.4770 5.4976 4.4481 3.5754 5.5406 6.3864 4.3319 4.4041 5.5670 4.9096 3.4585 3.8294 4.8294 3.4392 5.6447 5.2489 4.9490 4.6784 4.7139 6.5109 5.8639 6.3188 9.3057 6.3542 4.8233 4.6474 4.1711 4.4074 4.1008 3.2009 1.4151 9.0492 3.6943 1.4629 1.5214 2.0636 2.5356 2.1106 3.5442 1.5312 1.5899 3.3154 2.3931 5.6461 4.7187 3.6610 1.4616 3.3719 1.2478 1.3520 2.8805 1.0406 1.4538 1.3615 1.5106 1.5375 1.5360 1.4947 1.3549 5.7347 1.7445 2.6120 1.7887 1.9935 2.1547 1.3167 4.1300 2.0062 3.7306 2.8333 1.3206 1.5207 3.8744 1.8188 1.0526 1.1949 1.3500 1.6561 1.1047 1.2400 1.3450 2.8021 7.1207 6.3852 7.8076 7.1240 8.1363 1.0601 1.0308 1.0307 1.0535 1.0999 1.1039 1.1043 1.1188 1.0905 1.0927 1.1030 1.1031 1.0896 1.0919 1.0928 1.0916 1.0957
irintensity: 14.4523 0.2294 0.2409 0.0669 1.8929 0.1558 5.4920 4.3981 4.4981 0.1806 0.5419 0.5464 0.6691 5.1602 0.3204 5.0427 2.7980 7.8633 3.0101 0.7495 2.8786 1.1317 7.4423 6.3137 2.1888 5.7088 4.1646 4.6516 9.4344 1.7223 10.9777 5.2821 3.2497 5.4010 6.7033 0.6177 7.1843 5.0469 4.9848 4.5523 17.1268 10.5550 7.1454 41.1723 32.2781 7.2247 12.8848 2.1861 7.9616 41.7541 11.9647 37.1796 10.8301 15.2521 77.5951 13.4796 156.5873 19.1762 19.5747 4.2389 25.7196 23.9767 7.6841 22.1479 0.1653 24.1043 2.9899 9.9451 26.1624 25.6429 61.6469 13.9032 208.5811 9.9486 160.3890 18.3111 0.3180 4.3854 1.2330 12.8405 11.6861 8.1885 6.2894 2.9478 16.3427 27.9070 61.6428 15.0289 10.7902 46.1485 116.8416 7.8286 0.9249 37.1961 151.8790 16.4557 7.1454 7.2048 10.8964 1.0073 29.4787 84.9553 58.0425 132.0361 9.5867 26.1887 21.1775 33.3493 25.2754 22.4990 21.3643 21.2387 4.6183 5.1617 3.1904 1.7669 4.0403
temp: 298.150 k
press: 1.00000 atm
elementType: 8 8 8 8 7 6 6 6 6 6 6 6 6 6 6 6 6 6 6 6 6 6 6 6 1 1 1 1 1 1 1 1 1 1 1 1 1 1 1 1 1
symmnumber: 1
zpe: 830214.3 jmol-1
zpe.correction: 0.316212 hartree
zpe.thermalcorrener: 0.336647 hartree
zpe.thermalcorrenthalpy: 0.337591 hartree
zpe.thermalcorrgfe: 0.265265 hartree
zpe.sumelectzpe: -1088.101334 hartree
zpe.sumelectthermal: -1088.080899 hartree
zpe.sumelectthermalent: -1088.079955 hartree
zpe.sumelectthermalfe: -1088.152281 hartree
dipole: 0.3094 -3.9336 -0.6690
dipole: 4.0021
quadrupole: -124.5745 -140.2655 -140.7632
quadrupole: 6.4769 2.0170 -3.7007
quadrupole: 10.6265 -5.0644 -5.5621 6.4769 2.0170 -3.7007
hfenergy: -1088.4175462 hartree
pointgroup: C01 [X(C19H17N1O4)]
dipole: -0.0933296 1.566579 0.1275524 debye
polarizability: 260.8189669|14.7178215|274.8328812|17.9458686|0.6534201|156.9804516 unknown
InChI: InChI=1S/C19H17NO4/c1-21-17-7-14-10-20-9-13(15(14)8-18(17)22-2)5-12-3-4-16-19(6-12)24-11-23-16/h3-4,6-10H,5,11H2,1-2H3
charge 0 multiplicity 1
41 atoms
O  4.337551 2.159885 1.17886
O  4.844251 1.613355 -1.108475
O  -2.171952 2.448425 0.369976
O  -4.480068 1.293388 -0.97822
N  -1.483855 -4.003848 -0.082016
C  0.962901 -1.599012 1.646008
C  -0.254128 -2.082776 0.872426
C  -1.281784 -1.178729 0.412388
C  1.958175 -0.748307 0.846312
C  -2.411455 -1.742517 -0.296705
C  2.62037 0.338292 1.491612
C  -1.237328 0.238469 0.606658
C  3.560965 1.053932 0.748726
C  2.263218 -1.060955 -0.501895
C  -0.414044 -3.448387 0.600605
C  3.858048 0.733293 -0.591485
C  -3.470099 -0.88912 -0.740216
C  -2.265713 1.058767 0.142166
C  3.222352 -0.322433 -1.247873
C  -3.421047 0.484445 -0.511585
C  -2.442298 -3.161787 -0.509747
C  5.155675 2.555633 -0.000239
C  -2.097515 3.277447 -0.859343
C  -5.229992 2.010181 0.083116
H  1.493552 -2.489385 2.038731
H  0.636022 -1.02421 2.534891
H  2.404463 0.600687 2.531849
H  -0.380115 0.714484 1.090187
H  1.741549 -1.892573 -0.987027
H  0.341635 -4.168098 0.937699
H  -4.343387 -1.308849 -1.251068
H  3.453284 -0.568195 -2.287447
H  -3.287424 -3.612132 -1.046319
H  6.224489 2.466047 0.258878
H  4.871678 3.577697 -0.306634
H  -2.095175 4.319846 -0.507204
H  -2.965574 3.089195 -1.515677
H  -1.157829 3.059318 -1.400219
H  -5.750134 1.281479 0.732812
H  -5.966288 2.630682 -0.449338
H  -4.553874 2.640364 0.687729
