program: Orca
programVersion: 5.0.3
elementType: O O C C C C C C C C C C C C C C C C C C C C C H H H H H H H H H H H H H H H H H H H H H H H H H H H H H H Ag
elementType: Ag
charge: 1
multiplicity: 1
keywords: wB97X-D3 TightOpt Freq def2-TZVPP def2/J RIJCOSX TIGHTSCF defgrid3
frequency: 0.00 0.00 0.00 0.00 0.00 0.00 40.90 43.20 43.35 61.93 72.67 92.41 93.93 108.41 112.67 160.58 168.91 172.72 193.26 220.70 225.80 228.29 238.98 241.95 264.22 270.48 278.75 295.90 304.69 324.17 332.61 337.78 345.27 362.15 386.82 395.58 412.58 427.56 461.75 469.49 489.92 498.08 510.85 537.77 559.17 589.98 604.74 641.12 650.17 671.43 703.72 731.71 752.39 791.27 804.43 813.91 825.16 851.19 872.02 882.44 892.79 915.00 919.35 934.66 940.26 953.85 958.23 993.56 1002.94 1018.79 1028.49 1030.78 1044.94 1055.46 1057.82 1071.12 1087.11 1096.82 1116.51 1124.94 1134.59 1149.92 1161.22 1175.97 1190.83 1207.31 1217.52 1220.76 1233.82 1249.39 1257.35 1278.66 1280.24 1287.31 1305.02 1312.58 1318.22 1333.14 1342.54 1347.40 1348.96 1354.73 1368.04 1370.61 1388.81 1402.66 1405.64 1413.40 1416.35 1422.92 1424.88 1429.42 1435.65 1472.00 1483.10 1483.65 1490.87 1493.81 1495.09 1495.92 1501.73 1504.95 1505.25 1507.47 1508.45 1515.46 1518.38 1525.06 1555.37 1644.16 1656.42 1699.36 2854.98 2941.44 2963.42 3042.33 3047.11 3057.23 3061.68 3061.73 3069.69 3070.69 3073.19 3073.61 3076.99 3092.60 3102.57 3113.47 3116.71 3124.66 3128.61 3129.38 3139.39 3150.01 3152.34 3155.98 3158.62 3164.77 3175.28 3184.67 3216.60 3897.89
frequency: 40.90 43.20 43.35 61.93 72.67 92.41 93.93 108.41 112.67 160.58 168.91 172.72 193.26 220.70 225.80 228.29 238.98 241.95 264.22 270.48 278.75 295.90 304.69 324.17 332.61 337.78 345.27 362.15 386.82 395.58 412.58 427.56 461.75 469.49 489.92 498.08 510.85 537.77 559.17 589.98 604.74 641.12 650.17 671.43 703.72 731.71 752.39 791.27 804.43 813.91 825.16 851.19 872.02 882.44 892.79 915.00 919.35 934.66 940.26 953.85 958.23 993.56 1002.94 1018.79 1028.49 1030.78 1044.94 1055.46 1057.82 1071.12 1087.11 1096.82 1116.51 1124.94 1134.59 1149.92 1161.22 1175.97 1190.83 1207.31 1217.52 1220.76 1233.82 1249.39 1257.35 1278.66 1280.24 1287.31 1305.02 1312.58 1318.22 1333.14 1342.54 1347.40 1348.96 1354.73 1368.04 1370.61 1388.81 1402.66 1405.64 1413.40 1416.35 1422.92 1424.88 1429.42 1435.65 1472.00 1483.10 1483.65 1490.87 1493.81 1495.09 1495.92 1501.73 1504.95 1505.25 1507.47 1508.45 1515.46 1518.38 1525.06 1555.37 1644.16 1656.42 1699.36 2854.98 2941.44 2963.42 3042.33 3047.11 3057.23 3061.68 3061.73 3069.69 3070.69 3073.19 3073.61 3076.99 3092.60 3102.57 3113.47 3116.71 3124.66 3128.61 3129.38 3139.39 3150.01 3152.34 3155.98 3158.62 3164.77 3175.28 3184.67 3216.60 3897.89
formula: C21H30O2Ag
InChI: InChI=1S/C21H30O2.Ag/c1-5-6-7-8-15-12-18(22)20-16-11-14(2)9-10-17(16)21(3,4)23-19(20)13-15;/h11-13,16-17,22H,5-10H2,1-4H3;
54 atoms
O  -0.45154 2.704565 -0.568184
O  0.32642 -0.684104 2.696909
C  -2.197085 1.102447 -0.370612
C  -1.600634 0.475393 0.890708
C  -1.887251 2.599781 -0.427676
C  -3.644709 0.665823 -0.529633
C  -0.13238 0.855386 0.96004
C  -3.679275 -0.834254 -0.813321
C  -1.828692 -1.025341 0.866317
C  -2.757473 -1.629744 0.076323
C  0.348774 1.921317 0.178509
C  -2.321628 3.376131 0.808988
C  -2.43137 3.246098 -1.689291
C  0.801559 0.219911 1.793193
C  1.708582 2.206598 0.104735
C  -3.059621 -3.094735 0.191657
C  2.625569 1.455882 0.819213
C  2.157553 0.487505 1.701996
C  4.103305 1.610006 0.581359
C  4.567542 0.953556 -0.733767
C  4.117583 -0.503303 -0.916796
C  2.797115 -0.633052 -1.68012
C  2.144387 -2.002501 -1.527486
H  -1.648494 0.689016 -1.232261
H  -2.127352 0.862633 1.770743
H  -4.20637 0.88485 0.382278
H  -4.136065 1.197601 -1.342842
H  -4.687801 -1.231797 -0.678671
H  -3.432264 -1.034715 -1.860611
H  -1.3796 -1.608152 1.665299
H  -2.117018 4.43629 0.667916
H  -1.791001 3.052283 1.703833
H  -3.39231 3.257236 0.980458
H  -1.984804 4.231656 -1.811066
H  -3.511736 3.370608 -1.630799
H  -2.190633 2.651578 -2.571428
H  2.027226 3.004531 -0.553459
H  -3.127971 -3.565289 -0.790278
H  -2.325658 -3.628563 0.793489
H  -4.037918 -3.215636 0.662282
H  2.8536 -0.060826 2.327491
H  4.649738 1.161477 1.413346
H  4.370874 2.667655 0.560903
H  4.214464 1.549018 -1.580267
H  5.656264 1.009122 -0.760873
H  1.03201 -0.947166 3.289722
H  4.02366 -0.98165 0.063665
H  4.888113 -1.06414 -1.449788
H  2.101475 0.135021 -1.33766
H  2.969151 -0.431536 -2.739587
H  2.758707 -2.828086 -1.889441
H  1.223676 -2.080168 -2.148035
H  1.9779 -2.237061 -0.459019
Ag -0.159032 -1.627855 -0.577777
totalener: -1115.68257186 hartree
nucrepener: 2553.02101490 hartree
electener: -3668.70358676 hartree
oneelecener: -6630.83635887 hartree
twoeener: 2962.13277211 hartree
kineticenergy: 1020.44547288 hartree
xcener: -106.974853670692 hartree
chargesum: 1.0000000
charge: -0.287863 -0.309000 -0.156176 0.221667 0.383959 -0.201202 -0.310329 -0.109967 -0.320396 0.045495 0.282191 -0.340858 -0.281099 0.198668 -0.274824 -0.208359 0.082407 -0.203685 -0.150200 -0.155166 -0.135091 -0.168482 -0.079550 0.094153 0.115179 0.097045 0.106924 0.110925 0.103414 0.244865 0.117195 0.101745 0.103947 0.114985 0.089636 0.102093 0.117564 0.110430 0.089260 0.125536 0.092723 0.092053 0.107369 0.084475 0.099064 0.191984 0.068326 0.111365 0.050751 0.108436 0.122154 0.054275 0.054762 0.295229
charge: 0.328225 0.365762 -0.059928 -0.054300 -0.234077 0.011625 -0.078034 0.005675 -0.030154 -0.032525 -0.193675 0.035725 0.028422 -0.190383 -0.003727 0.037030 -0.067727 -0.035840 -0.001475 -0.008371 -0.019322 -0.026865 0.036486 0.049716 0.050805 0.032880 0.030796 0.042969 0.040307 0.033628 0.028914 0.020062 0.023937 0.028154 0.021865 0.020434 0.032181 0.032367 0.028265 0.038020 0.020109 0.030928 0.034574 0.024461 0.025367 -0.103270 0.020518 0.024173 0.023107 0.028384 0.038903 0.033919 0.034653 0.396327
qa: -0.2879 -0.3090 -0.1562 0.2217 0.3840 -0.2012 -0.3103 -0.1100 -0.3204 0.0455 0.2822 -0.3409 -0.2811 0.1987 -0.2748 -0.2084 0.0824 -0.2037 -0.1502 -0.1552 -0.1351 -0.1685 -0.0795 0.0942 0.1152 0.0970 0.1069 0.1109 0.1034 0.2449 0.1172 0.1017 0.1039 0.1150 0.0896 0.1021 0.1176 0.1104 0.0893 0.1255 0.0927 0.0921 0.1074 0.0845 0.0991 0.1920 0.0683 0.1114 0.0508 0.1084 0.1222 0.0543 0.0548 0.2952
va: 2.1627 2.1594 3.8835 3.6524 3.6550 3.9242 3.5053 3.9407 3.7637 3.6083 4.0078 3.9761 3.9265 3.8170 4.0258 3.9599 3.6745 3.9321 3.8718 3.8962 3.8403 3.9265 3.9655 1.0257 0.9985 1.0114 1.0141 1.0138 1.0114 1.0183 1.0102 0.9952 1.0042 1.0143 1.0027 1.0027 1.0261 0.9974 1.0107 0.9998 1.0249 1.0101 1.0090 1.0067 1.0133 1.0441 1.0128 1.0085 1.0058 1.0147 0.9904 1.0215 1.0132 1.3257
dispcorr: -0.034455287 hartree
energy: -1115.717032972562
dipole: 7.20115 -7.74942 -0.54827 116.34174 -118.04362 -1.70189 27.10312 -27.36317 -0.26006
magnitude: 1.80684 au
magnitude: 4.59261 debye
temp: 298.15 k
press: 1.00 atm
zeropoint: 0.47398476 hartree
thermalvibcorrection: 0.02160963 hartree
thermalrotcorrection: 0.00141627 hartree
thermaltrasncorrection: 0.00141627 hartree
thermaltotal: -1115.21860605 hartree
thermalcorr: 0.02444217 hartree
nonthermalcorr: 0.47398476 hartree
totalcorr: 0.49842693 hartree
thermalcorrenthalpy: 0.00094421 hartree
totalenthalpy: -1115.21766184 hartree
totalentropycorr: -0.07494115 hartree
gibbsenthalpy: -1115.29260299 hartree
gibbsminuselec: 0.42442999 hartree
