program: Gaussian 09
title: 000043563
version: EM64L-G09RevD.01
frameworkgroup: C1[X(C17H14ClNO)]
method: RPBEPBE
basis: SDD
operation: Freq
keyword: #p
keyword: freq=noraman
keyword: PBEPBE/SDD
title: #p freq=noraman PBEPBE/SDD
converged: YES YES NO NO
title: Mulliken charges:
elementType: Cl O N C C C C C C C C C C C C C C C C C H H H H H H H H H H H H H H
charge: -0.062370 -0.266361 0.008643 0.425789 0.292152 -0.730828 0.160714 0.525397 -0.408319 0.187464 -0.550302 -0.492098 -0.239435 -0.398641 -0.442488 -0.369728 -0.206196 -0.206688 -0.117615 -0.532605 0.236925 0.230603 0.251902 0.252006 0.283191 0.226151 0.244900 0.238850 0.250391 0.254508 0.254710 0.225272 0.224816 0.249289
chargesum: 0.00000
title: Mulliken charges with hydrogens summed into heavy atoms:
elementType: Cl O N C C C C C C C C C C C C C C C C C
charge: -0.062370 -0.266361 0.008643 0.425789 0.292152 -0.263300 0.160714 0.525397 -0.156417 0.187464 -0.298295 -0.208907 -0.013285 -0.153741 -0.203639 -0.119337 0.048312 0.048022 -0.117615 0.166772
polarizability: 2.58687640e+02 5.10168268e+00 1.96336602e+02 -2.14780517e+01 -1.42673644e+01 1.55237000e+02
1716.lowfreq: -13.6157 -6.7334 -2.3522 -0.0012 0.0009 0.0010 21.2962 24.1634 34.4544
frequency: 21.0188 24.0984 34.4265 73.5281 101.4548 116.1799 169.0144 176.6350 194.7118 217.4219 242.9792 258.4602 285.4567 296.3662 330.5092 335.3964 388.8788 409.0771 448.8701 467.1207 481.1625 488.2160 498.9855 526.4411 589.4526 601.6739 624.7952 641.1284 654.3107 685.5495 717.5448 748.7786 772.4660 791.0387 813.5898 828.4647 832.0662 842.7300 873.2047 879.0447 910.5225 930.2976 949.6406 960.5874 970.6001 973.3672 999.7228 1012.4190 1072.3006 1075.4368 1104.2476 1113.9082 1117.9973 1146.3645 1157.2543 1184.0145 1190.4300 1195.5219 1206.4017 1238.9192 1253.3029 1266.8902 1288.8749 1311.2669 1341.5345 1376.5962 1388.3509 1397.0706 1405.0820 1418.2456 1433.1372 1446.2475 1461.7472 1468.5589 1473.3431 1477.6335 1499.6216 1552.3666 1576.7484 1587.3875 1600.2249 1618.8152 2966.1855 2972.6756 3020.7042 3056.7725 3118.2839 3122.8075 3131.8397 3136.6189 3138.4974 3157.9246 3164.9303 3166.4323 3169.7030 3175.0090
redmass: 4.7955 5.5926 5.3341 4.5811 6.3941 4.8358 3.6043 4.0519 3.8186 3.3214 1.6633 4.6140 3.0855 4.0506 4.1902 2.9023 7.0027 2.8885 4.8212 3.6578 3.7122 5.4655 4.0928 6.6074 4.3345 4.6919 6.6907 4.8057 5.1044 4.0270 4.0809 1.4141 5.9567 3.3656 2.0675 1.8956 1.3152 4.7238 1.5236 3.6549 1.7357 1.6491 1.4907 1.5968 1.4008 1.3306 4.2940 7.0594 2.7913 2.2718 1.5463 1.2594 2.4941 2.6274 1.4012 1.1198 1.4667 1.3467 2.0760 2.2389 1.9253 1.7170 1.5094 1.7323 2.3212 6.0854 2.8716 2.5657 1.9914 2.6371 2.4744 1.5291 1.1593 1.0497 1.0849 2.1492 4.0381 5.1086 7.2026 7.2882 6.2109 6.8263 1.0327 1.0598 1.1000 1.1042 1.0913 1.0898 1.0997 1.0874 1.0893 1.0921 1.0912 1.0950 1.0962 1.0974
irintensity: 0.7584 0.5153 0.3261 3.4045 0.8413 2.8891 0.9539 1.4108 0.7971 0.1957 0.1651 0.3201 0.2811 1.9982 0.8441 0.6626 9.1776 0.0332 4.7796 7.0022 14.0718 2.3468 2.5513 7.5782 4.1322 5.4220 2.0436 22.2155 13.0037 4.5062 12.7594 33.3326 3.0533 15.4720 44.3081 49.7703 10.4452 7.4124 1.0180 3.0444 20.8562 6.0365 0.7218 1.6546 0.4298 2.0156 47.2398 66.7775 37.1588 9.3030 6.6526 0.1105 13.0190 38.2870 13.4360 1.3170 7.6966 10.4972 10.0836 105.4760 10.6422 33.4840 3.2236 0.6147 0.5430 0.1225 36.3217 5.4259 8.7786 88.4554 6.5645 29.8745 31.6564 15.1351 35.7633 70.0012 3.1047 96.4051 43.2600 0.5294 4.2849 29.3898 69.7268 26.1565 9.5412 41.8156 30.8228 11.3679 21.6292 5.2414 4.5226 2.1039 15.7829 6.8954 0.6831 12.8863
temp: 298.150 k
press: 1.00000 atm
elementType: 17 8 7 6 6 6 6 6 6 6 6 6 6 6 6 6 6 6 6 6 1 1 1 1 1 1 1 1 1 1 1 1 1 1
symmnumber: 1
zpe: 688652.0 jmol-1
zpe.correction: 0.262294 hartree
zpe.thermalcorrener: 0.279323 hartree
zpe.thermalcorrenthalpy: 0.280267 hartree
zpe.thermalcorrgfe: 0.215304 hartree
zpe.sumelectzpe: -1244.843477 hartree
zpe.sumelectthermal: -1244.826448 hartree
zpe.sumelectthermalent: -1244.825503 hartree
zpe.sumelectthermalfe: -1244.890467 hartree
dipole: 2.1702 -3.0491 2.3667
dipole: 4.4280
quadrupole: -121.5197 -122.5910 -118.7234
quadrupole: -22.9519 -5.0085 2.4235
quadrupole: -0.5750 -1.6463 2.2213 -22.9519 -5.0085 2.4235
hfenergy: -1245.1057706 hartree
pointgroup: C01 [X(C17H14Cl1N1O1)]
dipole: -1.0579493 1.3577048 0.2690566 debye
polarizability: 250.8166324|20.6346988|204.3656077|26.1076809|-2.1308031|155.0790023 unknown
InChI: InChI=1S/C17H14ClNO/c1-20-17-4-2-3-15-13(10-19-11-16(15)17)9-12-5-7-14(18)8-6-12/h2-8,10-11H,9H2,1H3
charge 0 multiplicity 1
34 atoms
Cl 5.842508 1.663611 -1.177712
O  -4.146751 -0.065549 -1.528111
N  -1.612084 -2.985136 -0.053936
C  -0.141479 -1.275304 0.954839
C  -0.992359 -0.219857 0.454727
C  1.103419 -0.983923 1.780152
C  -2.161523 -0.60947 -0.302388
C  2.251982 -0.305786 1.025863
C  -0.739388 1.173701 0.679536
C  -3.045709 0.411929 -0.81042
C  -0.50108 -2.600288 0.675865
C  -2.408963 -2.004105 -0.522863
C  -1.61762 2.132959 0.173523
C  -2.777694 1.767289 -0.574465
C  3.044236 0.680376 1.665639
C  2.577873 -0.676039 -0.30338
C  4.138325 1.285625 1.006481
C  3.666895 -0.083907 -0.980518
C  4.432365 0.89035 -0.311696
C  -5.088111 0.918916 -2.070361
H  1.472361 -1.945452 2.189951
H  0.836483 -0.362025 2.657307
H  0.150015 1.483964 1.234036
H  0.116287 -3.427449 1.04779
H  -3.287294 -2.31141 -1.097864
H  -1.418904 3.196643 0.345632
H  -3.438161 2.551857 -0.953879
H  2.811626 0.982267 2.694361
H  1.9727 -1.429251 -0.8201
H  4.744727 2.046764 1.506081
H  3.912836 -0.373413 -2.006444
H  -4.588345 1.592724 -2.792398
H  -5.551441 1.515041 -1.260852
H  -5.857729 0.325248 -2.584096
