program: Gaussian 09
title: 000043545
version: EM64L-G09RevD.01
frameworkgroup: C1[X(C9H10NO4P)]
method: RPBEPBE
basis: SDD
operation: Freq
keyword: #p
keyword: freq=noraman
keyword: PBEPBE/SDD
title: #p freq=noraman PBEPBE/SDD
converged: YES YES NO NO
title: Mulliken charges:
elementType: P O O O O N C C C C C C C C C H H H H H H H H H H
charge: 1.398563 -0.553472 -0.501710 -0.490791 -0.593410 -0.020491 0.389538 -0.331575 -0.354373 -0.352098 -0.342785 0.397753 -0.483891 -0.477052 -0.251503 0.300471 0.261990 0.261230 0.261584 0.247959 0.237177 0.255550 0.240927 0.253869 0.246541
chargesum: 0.00000
title: Mulliken charges with hydrogens summed into heavy atoms:
elementType: P O O O O N C C C C C C C C C
charge: 1.398563 -0.553472 -0.501710 -0.490791 -0.593410 -0.020491 0.389538 -0.031105 -0.092383 -0.090868 -0.081201 0.397753 0.256796 0.264285 -0.251503
polarizability: 2.15041326e+02 1.14619451e+01 1.17813483e+02 -5.82700094e+00 1.56498427e+01 9.60750731e+01
1716.lowfreq: -3.0126 -0.0025 -0.0022 -0.0015 3.7785 7.6810 21.1353 29.9247 47.8970
frequency: 21.1053 29.8727 47.8387 62.8429 65.8400 82.6187 101.1630 132.2640 144.3542 165.4372 176.2111 218.0157 248.4256 259.5585 322.0794 334.6655 369.7403 408.7915 432.8479 454.3484 480.6205 544.3874 555.4251 576.2068 624.3350 647.0353 700.3623 729.6269 746.7985 837.4268 840.8414 858.1060 954.1710 963.0816 968.2209 979.8523 1007.3943 1063.4387 1112.4946 1113.1188 1114.5005 1129.0290 1131.8971 1174.6301 1194.9486 1210.9260 1304.6348 1357.6314 1418.0871 1424.4710 1426.2062 1456.9646 1458.6864 1470.6676 1472.6945 1488.3357 1570.6642 1610.6300 2178.2751 2994.8848 2999.8929 3101.2428 3110.3714 3138.3403 3142.2201 3153.3846 3159.2815 3171.3376 3182.6792
redmass: 4.5087 4.2987 1.2609 2.8124 2.8396 4.7236 4.7343 1.2577 4.7595 6.1510 5.1776 8.0208 6.5981 6.2346 7.6349 9.5793 7.4473 2.9586 7.5233 6.6755 7.4234 7.5011 3.9142 6.2993 9.4646 7.6989 10.7709 3.8591 7.6968 1.4232 4.5625 1.5925 11.0420 11.5974 1.3677 1.3562 2.9377 14.4290 1.2370 1.2368 1.3562 1.2824 1.2971 1.6749 2.2755 2.9192 1.2665 5.6735 3.6860 1.1252 1.1197 1.0529 1.0513 1.0529 1.0573 2.4150 7.4474 6.2093 12.6292 1.0291 1.0288 1.1060 1.1054 1.1044 1.1052 1.0898 1.0895 1.0977 1.0976
irintensity: 1.2664 1.3715 0.3542 1.5440 4.2930 7.1346 3.5851 1.0665 4.7504 4.0426 5.2503 0.7412 6.3874 18.4656 10.9275 32.8367 17.3438 0.1109 26.2684 7.4413 12.3714 0.8780 21.5643 20.5999 113.8700 10.0919 139.3040 1.3655 151.8297 34.2050 185.2276 98.1269 206.2802 200.3194 0.9670 1.2752 12.3496 131.5775 0.8960 2.0386 9.7548 1.7151 0.1839 171.8521 19.0160 138.4066 0.5741 2.8009 5.1762 2.7953 4.2255 9.3560 10.2768 25.3819 14.8726 150.4705 7.5771 101.3789 48.9385 45.7345 34.9793 23.0531 22.2117 8.9383 12.9692 2.4039 2.8431 1.5631 2.0407
temp: 298.150 k
press: 1.00000 atm
elementType: 15 8 8 8 8 7 6 6 6 6 6 6 6 6 6 1 1 1 1 1 1 1 1 1 1
symmnumber: 1
zpe: 467312.1 jmol-1
zpe.correction: 0.177990 hartree
zpe.thermalcorrener: 0.194595 hartree
zpe.thermalcorrenthalpy: 0.195539 hartree
zpe.thermalcorrgfe: 0.130997 hartree
zpe.sumelectzpe: -1044.676519 hartree
zpe.sumelectthermal: -1044.659914 hartree
zpe.sumelectthermalent: -1044.658970 hartree
zpe.sumelectthermalfe: -1044.723512 hartree
dipole: 5.2570 1.5901 3.1546
dipole: 6.3337
quadrupole: -120.5844 -84.1055 -96.7895
quadrupole: -0.4673 11.3909 -1.0083
quadrupole: -20.0913 16.3876 3.7036 -0.4673 11.3909 -1.0083
hfenergy: -1044.8545091 hartree
pointgroup: C01 [X(C9H10N1O4P1)]
dipole: 2.0420889 -0.5748014 -1.307266 debye
dipolederiv: 2.9773074 -0.2946769 -0.1152856 0.6279807 1.9374041 -0.106264 -0.0859911 -0.5410547 1.7030104 -2.6393664 -0.0004509 -0.0390716 -0.1263999 -0.5053438 0.0001454 -0.3317844 0.0135427 -0.4227782 -0.7532326 -0.1229773 0.1460897 -0.4081675 -1.0112765 0.3169053 0.3269702 0.5048292 -0.8382877 -0.8857849 0.363 0.1089065 0.4168334 -1.1356606 -0.1165455 0.2092099 -0.1710513 -0.5650175 -0.8111288 -0.001807 -0.0073285 -0.1151528 -0.6313944 -0.0294435 0.0122114 0.0486878 -0.6566729 -0.5456605 0.0365087 -0.0050935 0.0614452 -0.241899 0.0118551 -0.0140451 0.0116735 -0.2392471 1.91817 0.0325466 0.0738737 -0.5491413 0.106396 0.0562595 0.0794875 0.0450709 0.1620414 -0.4016918 0.0498878 0.0522723 0.3083421 -0.1400247 0.0201404 0.1922925 0.0135506 -0.1175434 -0.5396634 -0.0771864 -0.0508531 -0.1533364 -0.0295973 0.0681052 -0.1278579 0.0788272 -0.0966668 0.18463 -0.0535466 0.0120507 0.0213907 0.0104424 0.1230225 0.0732174 0.1002614 -0.0164153 0.1942894 0.003556 0.0533117 -0.1307269 0.0059744 0.0974064 -0.0662324 0.1071508 -0.0351791 -0.2301048 0.025544 -0.0119515 0.0774573 0.0732422 -0.018308 -0.0101622 -0.0165695 0.0772958 0.3785349 0.2180575 -0.144439 0.2990853 0.6375614 -0.3263508 -0.0309164 -0.0695172 0.2120483 0.2629566 -0.0246988 -0.0557498 -0.2552142 0.6043561 0.0891231 -0.303704 0.3139625 0.301843 0.5849053 -0.0887113 0.0120872 -0.1238366 -0.0111078 -0.0480743 0.0225347 -0.045613 -0.011614 0.1116683 -0.0225069 -0.0618344 -0.0214833 0.1121035 -0.0477365 -0.0532195 -0.0465986 0.1277535 0.0773437 0.0655327 0.0276463 0.0604715 0.0630122 -0.0798384 0.0427442 -0.0764867 0.1010117 0.0581469 0.0463305 0.0242826 0.0496253 0.0499134 -0.0869733 0.025978 -0.0826063 0.0932334 0.0249551 -0.0483494 -0.0614226 -0.0295848 0.0812161 -0.0749372 -0.060298 -0.0749057 0.0879941 0.0794993 -0.0313983 -0.0380959 -0.0475134 0.039025 0.0677912 -0.0232045 0.0802574 -0.0736332 -0.1713775 -0.0630661 0.026918 -0.0272891 0.01601 0.0527196 -0.0275751 0.0069329 0.0978929 0.050684 0.0368667 0.069301 0.0109706 -0.0303308 -0.0089339 0.0416711 -0.119582 0.0489618 0.1169747 -0.0135588 0.0101111 0.0043591 0.0225555 0.0664917 0.0758455 -0.0185696 -0.1044391 0.0171556 -0.1384103 0.0179882 -0.064153 -0.0384637 -0.0198008 0.0608124 -0.0411042 0.0739928 -0.0592105 0.1035143 -0.0437135 0.114038 0.0158865 -0.0067592 -0.0279841 -0.0210884 0.0904149 unknown
polarizability: 214.7906663|-13.0608525|116.0761689|3.7181643|17.0266569|98.0630473 unknown
InChI: InChI=1S/C9H10NO4P/c1-12-15(11,13-2)14-9-5-3-8(7-10)4-6-9/h3-6H,1-2H3
charge 0 multiplicity 1
25 atoms
P  2.513988 0.267049 0.36245
O  1.203514 -0.866983 0.16406
O  2.631472 0.82051 -1.271094
O  3.783691 -0.839782 0.615919
O  2.404854 1.390594 1.471075
N  -5.500416 0.573919 -0.120815
C  -0.161453 -0.49027 0.117771
C  -0.689417 0.562144 0.903312
C  -0.987917 -1.274049 -0.717766
C  -2.068946 0.834412 0.833651
C  -2.366471 -1.003038 -0.773229
C  -2.918951 0.058053 -0.001578
C  3.187552 2.17987 -1.513706
C  3.983523 -1.988816 -0.30834
C  -4.328473 0.33979 -0.065605
H  -0.036767 1.149068 1.557435
H  -0.541226 -2.077815 -1.30911
H  -2.494382 1.644861 1.433236
H  -3.018851 -1.602268 -1.415487
H  2.899887 2.411514 -2.549381
H  4.286626 2.168367 -1.412443
H  2.74893 2.911622 -0.813867
H  4.071453 -1.638781 -1.351661
H  3.14902 -2.701576 -0.207799
H  4.927062 -2.441393 0.028972
