program: Orca
programVersion: 5.0.3
elementType: Ag C H H C H H C C C H H H H C H H H
elementType: Ag
charge: 0
multiplicity: 1
keywords: DLPNO-CCSD(T) def2-TZVPP def2-TZVPP/C VeryTightSCF
formula: C6H11Ag
InChI: InChI=1S/C6H11.Ag/c1-4-5-6(2)3;/h5H,1,4H2,2-3H3;
18 atoms
Ag 1.572289 0.040301 0.063407
C  -0.102323 1.29478 0.316458
H  0.269703 2.319596 0.295821
H  -0.460004 1.077386 1.324192
C  -1.21457 1.083965 -0.70832
H  -2.060979 1.732438 -0.457402
H  -0.873888 1.410501 -1.6939
C  -1.672794 -0.341477 -0.808034
C  -2.71163 -0.90815 -0.198735
C  -3.655239 -0.182135 0.717611
H  -3.395402 0.865225 0.853402
H  -4.678863 -0.233313 0.336798
H  -3.663681 -0.655373 1.703173
H  -1.047974 -0.981753 -1.429111
C  -3.017535 -2.368395 -0.380451
H  -2.308864 -2.847852 -1.055031
H  -2.988115 -2.894878 0.577681
H  -4.023636 -2.509238 -0.785309
totalener: -379.75531109 hartree
nucrepener: 357.27846884 hartree
electener: -737.03377993 hartree
oneelecener: -1286.67802296 hartree
twoeener: 549.64424303 hartree
kineticenergy: 290.01469726 hartree
chargesum: -0.0000000
charge: 0.309738 -0.438246 0.069749 0.063975 -0.023820 0.037979 0.042483 -0.039356 -0.049375 -0.185455 0.066429 0.059513 0.057250 0.024854 -0.164047 0.056492 0.054311 0.057526
charge: 0.369215 -0.234195 -0.027690 -0.024061 -0.076191 0.005266 0.013291 -0.030377 -0.101754 0.023510 0.009624 0.010342 0.010864 0.006531 0.018709 0.009675 0.007996 0.009245
qa: 0.3097 -0.4382 0.0697 0.0640 -0.0238 0.0380 0.0425 -0.0394 -0.0494 -0.1855 0.0664 0.0595 0.0572 0.0249 -0.1640 0.0565 0.0543 0.0575
va: 0.9648 3.8838 1.0087 1.0118 3.8624 0.9994 1.0046 3.7321 3.7380 3.9632 1.0067 1.0013 0.9998 1.0288 3.9566 1.0059 0.9983 0.9996
e0: -379.755311029 hartree
corrType: DLPNO BASED
energy: -381.553131813967
dipole: -128.62081 129.68271 1.06191 -9.70752 9.05803 -0.64949 -6.30630 6.29052 -0.01578
magnitude: 1.24488 au
magnitude: 3.16424 debye
