program: Orca
programVersion: 5.0.3
elementType: Ag C H H C H H C C C H H H H C H H H
elementType: Ag
charge: 0
multiplicity: 1
keywords: wB97X-D3 TightOpt Freq def2-TZVPP def2/J RIJCOSX TIGHTSCF defgrid3
frequency: 0.00 0.00 0.00 0.00 0.00 0.00 23.92 58.27 127.53 140.26 163.95 216.89 322.89 378.93 407.60 455.74 490.07 548.66 661.66 791.28 880.93 920.64 952.49 971.83 1019.69 1050.99 1098.61 1112.03 1134.17 1151.21 1225.40 1276.76 1348.56 1382.54 1422.35 1429.13 1460.31 1477.07 1483.99 1495.83 1499.34 1509.73 1775.21 3033.11 3039.57 3047.67 3070.48 3080.57 3095.01 3099.01 3126.90 3131.83 3139.49 3160.57
frequency: 23.92 58.27 127.53 140.26 163.95 216.89 322.89 378.93 407.60 455.74 490.07 548.66 661.66 791.28 880.93 920.64 952.49 971.83 1019.69 1050.99 1098.61 1112.03 1134.17 1151.21 1225.40 1276.76 1348.56 1382.54 1422.35 1429.13 1460.31 1477.07 1483.99 1495.83 1499.34 1509.73 1775.21 3033.11 3039.57 3047.67 3070.48 3080.57 3095.01 3099.01 3126.90 3131.83 3139.49 3160.57
formula: C6H11Ag
InChI: InChI=1S/C6H11.Ag/c1-4-5-6(2)3;/h5H,1,4H2,2-3H3;
18 atoms
Ag 1.572289 0.040301 0.063407
C  -0.102323 1.29478 0.316458
H  0.269703 2.319596 0.295821
H  -0.460004 1.077386 1.324192
C  -1.21457 1.083965 -0.70832
H  -2.060979 1.732438 -0.457402
H  -0.873888 1.410501 -1.6939
C  -1.672794 -0.341477 -0.808034
C  -2.71163 -0.90815 -0.198735
C  -3.655239 -0.182135 0.717611
H  -3.395402 0.865225 0.853402
H  -4.678863 -0.233313 0.336798
H  -3.663681 -0.655373 1.703173
H  -1.047974 -0.981753 -1.429111
C  -3.017535 -2.368395 -0.380451
H  -2.308864 -2.847852 -1.055031
H  -2.988115 -2.894878 0.577681
H  -4.023636 -2.509238 -0.785309
totalener: -382.25685631 hartree
nucrepener: 352.97087497 hartree
electener: -735.22773128 hartree
oneelecener: -1278.23003674 hartree
twoeener: 543.00230546 hartree
kineticenergy: 290.30650462 hartree
xcener: -34.347655100947 hartree
chargesum: -0.0000000
charge: 0.127578 -0.311862 0.106166 0.100633 -0.144227 0.073881 0.078286 -0.087678 -0.045250 -0.228965 0.079134 0.085435 0.082543 0.055536 -0.206670 0.073534 0.079846 0.082078
charge: 0.297209 -0.217722 -0.011102 -0.007401 -0.080674 0.015324 0.023014 -0.035337 -0.109711 0.011302 0.012712 0.017366 0.018068 0.012926 0.007805 0.015445 0.015044 0.015732
qa: 0.1276 -0.3119 0.1062 0.1006 -0.1442 0.0739 0.0783 -0.0877 -0.0452 -0.2290 0.0791 0.0854 0.0825 0.0555 -0.2067 0.0735 0.0798 0.0821
va: 1.0892 3.9713 1.0161 1.0200 3.9375 1.0003 1.0047 3.7647 3.7791 3.9379 1.0141 0.9995 0.9986 1.0372 3.9364 1.0109 0.9982 0.9985
dispcorr: -0.005518010 hartree
energy: -382.271973071722
dipole: -128.62081 129.24370 0.62289 -9.70751 9.28663 -0.42088 -6.30628 6.32395 0.01767
magnitude: 0.75196 au
magnitude: 1.91134 debye
temp: 298.15 k
press: 1.00 atm
zeropoint: 0.15466637 hartree
thermalvibcorrection: 0.00656164 hartree
thermalrotcorrection: 0.00141627 hartree
thermaltrasncorrection: 0.00141627 hartree
thermaltotal: -382.10791251 hartree
thermalcorr: 0.00939419 hartree
nonthermalcorr: 0.15466637 hartree
totalcorr: 0.16406056 hartree
thermalcorrenthalpy: 0.00094421 hartree
totalenthalpy: -382.10696830 hartree
totalentropycorr: -0.04587614 hartree
gibbsenthalpy: -382.15284445 hartree
gibbsminuselec: 0.11912862 hartree
