program: Gaussian 09
title: 000043542
version: EM64L-G09RevD.01
frameworkgroup: C1[X(C8H12N2O2S)]
method: RPBEPBE
basis: SDD
operation: Freq
keyword: #p
keyword: freq=noraman
keyword: PBEPBE/SDD
title: #p freq=noraman PBEPBE/SDD
converged: YES YES NO NO
title: Mulliken charges:
elementType: S O O N N C C C C C C C C H H H H H H H H H H H H
charge: 0.316191 -0.300203 -0.255035 -0.221318 -0.063837 -0.354715 -0.490649 -0.103686 0.289035 -0.740720 0.033804 -0.489681 -0.562660 0.251917 0.251989 0.238145 0.238145 0.249922 0.298735 0.260961 0.232074 0.244552 0.244006 0.218186 0.214842
chargesum: 0.00000
title: Mulliken charges with hydrogens summed into heavy atoms:
elementType: S O O N N C C C C C C C C
charge: 0.316191 -0.300203 -0.255035 -0.221318 -0.063837 0.149192 -0.014359 -0.103686 0.289035 -0.192063 0.294764 0.230951 -0.129632
polarizability: 1.82408749e+02 -7.61050586e+00 1.31001288e+02 4.18209713e+00 2.22703208e+00 7.89901442e+01
1716.lowfreq: -0.0020 -0.0013 0.0008 5.9337 6.3391 10.6091 35.6228 49.9482 66.1008
frequency: 35.6176 49.8654 66.0864 85.4520 89.3055 105.1946 127.3154 138.3862 176.9834 193.6247 221.9743 235.0560 291.7342 320.5206 372.3767 399.0104 486.7045 526.1260 552.6483 591.0184 689.4260 703.1795 710.9432 768.0622 819.6434 868.9771 885.7727 934.1395 944.0521 947.4165 968.3408 992.0141 1019.2623 1073.4985 1086.9899 1112.0785 1118.8120 1147.8744 1180.3916 1183.0056 1212.0230 1215.1701 1242.2406 1282.2660 1293.9389 1299.3559 1353.8406 1408.0525 1431.8712 1434.8218 1451.6749 1467.8956 1469.1805 1492.7867 1542.3485 1644.9430 1651.8091 3005.4711 3009.1304 3027.7011 3034.7994 3055.5382 3087.5247 3091.1077 3107.9989 3113.3043 3132.7312 3148.0540 3197.9267
redmass: 5.1343 3.5220 2.6950 2.6106 1.2425 3.3483 4.0912 2.9624 3.9160 3.3446 4.4551 5.1719 3.2019 4.1485 5.1283 2.7724 6.6190 5.7339 2.8637 7.5650 10.9575 2.0667 6.1299 7.1937 1.1961 1.4651 8.6868 2.0591 1.3361 4.2686 4.9941 7.3841 1.1390 1.6455 6.9924 1.5998 1.2558 1.4374 1.1874 5.5307 1.0764 1.3358 1.1810 1.2208 1.5761 1.5906 2.8546 1.1161 1.2375 1.1838 1.0495 1.0552 1.1529 1.0846 5.8155 10.5103 4.6227 1.0296 1.0588 1.0596 1.0573 1.1071 1.0608 1.1078 1.1049 1.1040 1.0973 1.1047 1.1141
irintensity: 2.5689 0.3016 0.3316 1.5656 0.4109 0.5935 1.3193 0.3367 15.6234 3.3224 6.9602 5.0832 5.4034 23.4003 1.6118 1.4922 0.4573 16.1990 10.8953 2.2463 20.4400 24.9738 4.0615 1.4011 0.6394 7.0477 25.1050 11.5086 82.4312 40.2661 13.1480 146.7033 16.2112 0.0212 175.5672 26.8302 0.0926 47.9653 9.5868 139.6301 0.0395 0.1898 10.6122 14.0885 105.3743 138.0094 311.6824 13.2547 99.2303 9.7995 13.7777 11.4388 1.1365 8.4067 108.6018 356.2622 8.1991 47.2718 40.5892 43.2829 17.1073 6.5708 9.8030 29.5099 26.4877 1.2897 4.3223 16.9005 24.5503
temp: 298.150 k
press: 1.00000 atm
elementType: 16 8 8 7 7 6 6 6 6 6 6 6 6 1 1 1 1 1 1 1 1 1 1 1 1
symmnumber: 1
zpe: 509156.9 jmol-1
zpe.correction: 0.193928 hartree
zpe.thermalcorrener: 0.208488 hartree
zpe.thermalcorrenthalpy: 0.209432 hartree
zpe.thermalcorrgfe: 0.150792 hartree
zpe.sumelectzpe: -969.024840 hartree
zpe.sumelectthermal: -969.010279 hartree
zpe.sumelectthermalent: -969.009335 hartree
zpe.sumelectthermalfe: -969.067975 hartree
dipole: -2.3613 2.4029 0.3717
dipole: 3.3894
quadrupole: -69.5129 -83.6866 -82.7394
quadrupole: -4.1673 -1.4352 1.0567
quadrupole: 9.1335 -5.0403 -4.0931 -4.1673 -1.4352 1.0567
hfenergy: -969.2187677 hartree
pointgroup: C01 [X(C8H12N2O2S1)]
dipole: 0.975638 0.7754561 -0.4743146 debye
dipolederiv: -0.2918307 -0.2709968 0.0190095 -0.3237989 -0.1194333 0.1136165 0.0995671 0.0696587 -0.1441588 -1.7916687 0.4256959 0.0663642 0.0511406 -0.4656017 0.0559211 0.2816339 -0.020557 -0.3463779 -0.8499248 0.0234577 0.0545504 0.0595312 -0.9475189 0.2669715 0.0879413 0.2681874 -0.4442245 -1.5212229 0.7053446 -0.082224 0.3691363 -0.9361128 0.2539592 0.130239 0.1883912 -0.2606438 -0.6360023 0.2871692 -0.0718084 -0.1315395 -0.9313879 0.2354479 0.1074461 0.1986021 -0.4014445 0.0637312 0.0948392 0.0025174 0.1731372 0.243496 -0.0055557 -0.0314934 0.0036741 0.3047303 0.1827159 0.0735571 -0.0087257 0.0418475 0.3602202 -0.0275065 -0.0036909 -0.0541117 0.2855675 1.5069156 -0.2847732 -0.0901327 0.4419476 0.8599367 -0.3549683 -0.4864351 -0.2955381 0.1926907 2.2507765 -0.6097251 -0.0587875 -0.3650803 1.4745003 -0.4256945 -0.2364306 -0.3712581 0.5201401 0.4821432 0.0251765 -0.0001444 -0.0946492 0.0224381 -0.0216801 0.0168749 0.0431093 0.1181686 -0.0327473 0.1320382 0.0624415 0.1358409 -0.1028746 -0.092961 0.2406597 -0.039613 0.0619646 0.6648446 -0.209409 0.0241874 -0.3546543 0.3986827 0.0047147 0.0716292 -0.012621 0.2650589 -0.3024416 0.1319081 0.0106529 0.1353356 -0.2310209 -0.1571111 -0.0803313 -0.1533768 0.0648158 0.0261938 -0.0226112 0.0734963 0.009278 0.0495733 -0.045946 0.0984759 -0.0008996 -0.0806266 -0.0432913 -0.0920374 -0.0470363 -0.0702873 0.0292935 -0.0162297 -0.0858971 -0.0457025 0.0102745 0.033231 -0.0831948 0.0264971 -0.021832 -0.1421553 -0.0485267 -0.0128708 -0.115089 0.0387009 0.0339942 -0.0299607 -0.0199493 0.0129231 0.0377381 0.0488038 -0.0124278 0.1434839 -0.1282723 -0.0473972 -0.0408433 0.0797388 -0.0351112 0.0693777 0.1044536 0.0112475 0.0423872 -0.01728 0.0191236 -0.0311765 -0.039131 0.0723795 -0.0113854 -0.0672248 -0.0966787 -0.028331 0.0637757 0.1339093 -0.0711761 0.0537978 -0.0483862 0.0794578 0.0858313 0.0089588 0.0489046 -0.0153558 -0.1112391 -0.0126015 0.0510963 -0.0728109 0.0680004 0.038379 0.0797185 0.0264544 0.0949619 0.0320392 -0.043121 -0.0529583 0.08297 -0.0829033 -0.0842458 -0.0506391 -0.0749452 0.0332561 0.0476098 0.0273121 0.0199393 0.1081001 0.0424633 0.0195778 -0.0720961 0.0477802 -0.1104209 0.0698442 -0.0528719 -0.0885026 -0.0964533 0.1438481 0.0257106 -0.1342898 0.0166819 -0.0685663 0.0806936 -0.0720004 0.015111 -0.0789648 0.0913678 0.0942634 0.0688887 0.1147281 -0.0367343 unknown
polarizability: 183.2447592|4.6843829|122.3877237|-0.666096|-18.7572197|86.7676991 unknown
InChI: InChI=1S/C8H12N2O2S/c1-3-6-13-7-9-4-5-10(7)8(11)12-2/h3H,1,4-6H2,2H3
charge 0 multiplicity 1
25 atoms
S  -1.228646 -0.910442 0.938672
O  3.232146 -0.495564 -0.153264
O  1.541922 -1.844918 0.77536
N  1.103155 0.314389 -0.067823
N  -0.824887 1.578677 -0.21802
C  1.591003 1.572871 -0.709275
C  0.275672 2.420107 -0.790299
C  -0.30341 0.439068 0.165858
C  1.909297 -0.771675 0.236618
C  -2.947942 -0.039217 0.978591
C  -3.658136 -0.108267 -0.341222
C  4.188387 -1.591493 0.125897
C  -4.793261 -0.819833 -0.561992
H  2.026953 1.348614 -1.696966
H  2.371471 2.036919 -0.084099
H  0.351148 3.357277 -0.210609
H  0.020188 2.689357 -1.830424
H  -3.485144 -0.567575 1.783609
H  -2.729223 1.000373 1.270407
H  -3.205087 0.484028 -1.14658
H  5.154718 -1.215364 -0.2383
H  3.890059 -2.507438 -0.410944
H  4.22576 -1.801878 1.207828
H  -5.283818 -0.823506 -1.541661
H  -5.265223 -1.416312 0.229138
