program: Orca
programVersion: 5.0.3
elementType: C N C C N C C C C C C C C C C N N C C H H H H H H H H H H H H H H H H H H H H
charge: 2
multiplicity: 1
keywords: Freq PBEh-3c RIJCOSX CPCM(CH2Cl2)
frequency: 0.00 0.00 0.00 0.00 0.00 0.00 20.80 75.35 81.98 102.82 120.12 147.63 159.19 165.94 186.67 191.14 202.21 209.27 264.55 286.58 289.61 328.94 352.06 387.77 391.61 393.77 426.52 428.92 449.37 491.09 503.51 534.26 569.59 586.46 636.62 652.17 692.68 723.36 768.02 770.73 779.59 794.19 838.30 899.55 907.51 912.24 915.62 985.60 987.85 1023.16 1027.29 1027.74 1030.28 1046.45 1049.62 1054.52 1055.47 1076.47 1085.62 1100.96 1102.26 1122.86 1125.61 1140.79 1145.48 1156.83 1159.33 1163.24 1220.39 1246.36 1264.74 1289.39 1313.79 1317.18 1330.22 1355.31 1389.29 1423.62 1425.70 1447.85 1448.88 1450.73 1459.75 1460.58 1463.80 1468.39 1469.55 1473.39 1474.05 1485.77 1488.14 1490.58 1532.12 1614.78 1617.86 1652.95 1655.45 2939.83 2940.67 2945.39 2948.72 3035.98 3037.04 3042.70 3043.86 3078.95 3080.82 3094.40 3097.26 3140.47 3141.97 3148.67 3151.27 3154.15 3156.02 3162.64 3164.57
frequency: 20.80 75.35 81.98 102.82 120.12 147.63 159.19 165.94 186.67 191.14 202.21 209.27 264.55 286.58 289.61 328.94 352.06 387.77 391.61 393.77 426.52 428.92 449.37 491.09 503.51 534.26 569.59 586.46 636.62 652.17 692.68 723.36 768.02 770.73 779.59 794.19 838.30 899.55 907.51 912.24 915.62 985.60 987.85 1023.16 1027.29 1027.74 1030.28 1046.45 1049.62 1054.52 1055.47 1076.47 1085.62 1100.96 1102.26 1122.86 1125.61 1140.79 1145.48 1156.83 1159.33 1163.24 1220.39 1246.36 1264.74 1289.39 1313.79 1317.18 1330.22 1355.31 1389.29 1423.62 1425.70 1447.85 1448.88 1450.73 1459.75 1460.58 1463.80 1468.39 1469.55 1473.39 1474.05 1485.77 1488.14 1490.58 1532.12 1614.78 1617.86 1652.95 1655.45 2939.83 2940.67 2945.39 2948.72 3035.98 3037.04 3042.70 3043.86 3078.95 3080.82 3094.40 3097.26 3140.47 3141.97 3148.67 3151.27 3154.15 3156.02 3162.64 3164.57
formula: C15H20N4
InChI: InChI=1S/C15H20N4/c1-16(2)15(17(3)4)18-11-7-5-9-13(18)14-10-6-8-12-19(14)15/h5-12H,1-4H3
39 atoms
C  -1.153689 0.950907 -2.038889
N  -1.598796 0.340885 -0.791657
C  -2.730748 -0.557407 -1.017081
C  -0.623656 -0.05147 0.124987
N  0.36526 1.105371 0.288822
C  0.019452 2.299335 0.768333
C  0.999063 3.255056 0.940891
C  2.313168 2.957254 0.606501
C  2.639461 1.708009 0.091213
C  1.62341 0.79654 -0.056849
C  1.625594 -0.559758 -0.570291
C  2.631316 -1.314298 -1.121916
C  2.318189 -2.606843 -1.526554
C  1.031197 -3.100162 -1.359431
C  0.061767 -2.296621 -0.795843
N  0.387626 -1.057369 -0.430829
N  -1.118259 -0.551526 1.330157
C  -2.175238 0.208315 1.997569
C  -0.156627 -1.067668 2.29744
H  -0.651244 0.240399 -2.704399
H  -2.034567 1.322472 -2.557203
H  -0.501397 1.805579 -1.877253
H  -3.594695 0.04363 -1.295969
H  -2.533547 -1.26034 -1.832216
H  -2.985031 -1.124953 -0.12754
H  -1.025156 2.475566 0.978681
H  0.723916 4.225066 1.327418
H  3.086569 3.700874 0.739903
H  3.652589 1.455532 -0.187944
H  3.627115 -0.908918 -1.232318
H  3.083244 -3.229793 -1.968541
H  0.772153 -4.105546 -1.656165
H  -0.94883 -2.631607 -0.6118
H  -1.761236 0.943027 2.694761
H  -2.814738 0.726739 1.290214
H  -2.78972 -0.486181 2.567895
H  0.460821 -0.279286 2.741642
H  0.492464 -1.829932 1.874314
H  -0.717201 -1.540879 3.100143
elementType: C N H
totalener: -800.56841514 hartree
nucrepener: 1570.84120037 hartree
electener: -2371.40961551 hartree
oneelecener: -4163.30421566 hartree
twoeener: 1791.89460015 hartree
cpcmener: -0.22674017 hartree
kineticenergy: 794.32728599 hartree
exchangeener: -61.870004400713 hartree
correlationener: -5.958713528251 hartree
xcener: -67.828717928964 hartree
chargesum: 2.0000000
charge: -0.558671 -0.418320 -0.578182 0.705787 -0.559390 0.076662 -0.327836 -0.074757 -0.357265 0.470090 0.469262 -0.356281 -0.074632 -0.327287 0.075486 -0.560377 -0.417336 -0.580758 -0.558968 0.247442 0.282647 0.267103 0.281843 0.253841 0.280551 0.370574 0.330914 0.333808 0.326919 0.326579 0.333682 0.331097 0.370379 0.253631 0.280789 0.283706 0.247306 0.267103 0.282862
charge: -0.262970 -0.173596 -0.262991 0.203752 0.049911 0.030831 -0.097015 -0.017531 -0.079992 0.071241 0.071612 -0.079733 -0.017432 -0.096917 0.030680 0.049640 -0.173918 -0.263231 -0.262936 0.129885 0.157915 0.141477 0.151377 0.132314 0.150942 0.197006 0.192837 0.190293 0.196052 0.195973 0.190241 0.192908 0.197109 0.132201 0.150889 0.151999 0.129863 0.141401 0.157916
qa: -0.5587 -0.4183 -0.5782 0.7058 -0.5594 0.0767 -0.3278 -0.0748 -0.3573 0.4701 0.4693 -0.3563 -0.0746 -0.3273 0.0755 -0.5604 -0.4173 -0.5808 -0.5590 0.2474 0.2826 0.2671 0.2818 0.2538 0.2806 0.3706 0.3309 0.3338 0.3269 0.3266 0.3337 0.3311 0.3704 0.2536 0.2808 0.2837 0.2473 0.2671 0.2829
va: 3.6200 3.0372 3.6205 3.7590 3.3525 3.6098 3.7775 3.6394 3.7130 3.4975 3.4963 3.7132 3.6392 3.7780 3.6113 3.3511 3.0359 3.6196 3.6204 0.8953 0.8935 0.8911 0.8890 0.8935 0.8930 0.8365 0.8720 0.8597 0.8769 0.8771 0.8598 0.8718 0.8365 0.8937 0.8929 0.8885 0.8955 0.8912 0.8933
dispcorr: -0.031809876 hartree
energy: -800.527360265517
dipole: -10.99021 12.53410 1.54389 -0.77704 0.90115 0.12411 2.14838 -2.46384 -0.31546
magnitude: 1.58067 au
magnitude: 4.01774 debye
temp: 298.15 k
press: 1.00 atm
zeropoint: 0.32929025 hartree
thermalvibcorrection: 0.01478729 hartree
thermalrotcorrection: 0.00141627 hartree
thermaltrasncorrection: 0.00141627 hartree
thermaltotal: -800.18045019 hartree
thermalcorr: 0.01761983 hartree
nonthermalcorr: 0.32929025 hartree
totalcorr: 0.34691008 hartree
thermalcorrenthalpy: 0.00094421 hartree
totalenthalpy: -800.17950598 hartree
totalentropycorr: -0.06136426 hartree
gibbsenthalpy: -800.24087023 hartree
gibbsminuselec: 0.28649003 hartree
