program: Orca
programVersion: 5.0.3
elementType: C N C C C C N C C H H H H H H H H H H
charge: 0
multiplicity: 1
keywords: SP DLPNO-CCSD(T) aug-cc-pVTZ aug-cc-pVTZ/C TightSCF CPCM(Acetonitrile)
formula: C7H10N2
InChI: InChI=1S/C7H10N2/c1-9(2)7-3-5-8-6-4-7/h3-6H,1-2H3
19 atoms
C  -2.233089 1.2399 0.7206
N  -1.605349 0.1932 -0.0535
C  -2.416709 -0.71123 -0.83596
C  -0.263179 0.03285 -0.01143
C  0.568721 0.8672 0.76281
C  1.932671 0.65779 0.75868
N  2.557151 -0.2947 0.06991
C  1.770991 -1.08514 -0.65743
C  0.397321 -0.9792 -0.73773
H  -1.858349 2.22911 0.44708
H  -2.080429 1.10693 1.79513
H  -3.302989 1.23194 0.53415
H  -2.159329 -0.67696 -1.89755
H  -3.461589 -0.43059 -0.74152
H  -2.319339 -1.74664 -0.49874
H  0.168391 1.67017 1.36469
H  2.560781 1.30906 1.35842
H  2.266361 -1.86788 -1.22348
H  -0.141229 -1.6788 -1.36073
elementType: C N H
totalener: -379.92421419 hartree
nucrepener: 434.44465636 hartree
electener: -814.36887055 hartree
oneelecener: -1375.26226646 hartree
twoeener: 560.89339591 hartree
cpcmener: -0.01563676 hartree
kineticenergy: 379.49657470 hartree
chargesum: -0.0000000
charge: -1.045090 -0.043752 -1.045631 1.051866 -0.313444 -0.634614 -0.682955 -0.632466 -0.315757 0.318929 0.323309 0.394643 0.324491 0.394509 0.317106 0.080162 0.714078 0.714007 0.080610
charge: 0.495557 0.251774 0.495383 -0.235605 0.225283 -0.023992 0.315586 -0.024023 0.225501 -0.153038 -0.148252 -0.168488 -0.151391 -0.168517 -0.149742 -0.204652 -0.188587 -0.188595 -0.204202
qa: -1.0451 -0.0438 -1.0456 1.0519 -0.3134 -0.6346 -0.6830 -0.6325 -0.3158 0.3189 0.3233 0.3946 0.3245 0.3945 0.3171 0.0802 0.7141 0.7140 0.0806
va: 3.5595 1.8518 3.5604 1.9730 2.5486 2.2736 1.8498 2.2750 2.5494 1.0414 1.0389 0.9302 1.0344 0.9304 1.0462 1.1120 0.1431 0.1428 1.1118
e0: -379.924213510 hartree
corrType: DLPNO BASED
energy: -381.603879508136
dipole: -9.68395 7.17085 -2.51310 1.07490 -0.79205 0.28286 -0.20870 0.14952 -0.05918
magnitude: 2.52966 au
magnitude: 6.42989 debye
