program: Gaussian 09
title: 000043578
version: EM64L-G09RevD.01
frameworkgroup: C1[X(C17H12ClNO2)]
method: RPBEPBE
basis: SDD
operation: Freq
keyword: #p
keyword: freq=noraman
keyword: PBEPBE/SDD
title: #p freq=noraman PBEPBE/SDD
converged: YES YES NO NO
title: Mulliken charges:
elementType: Cl O O N C C C C C C C C C C C C C C C C C H H H H H H H H H H H H
charge: -0.059587 -0.260038 -0.260994 0.012191 0.293162 0.425319 0.258427 -0.724730 0.002360 0.149595 -0.394623 0.522534 -0.356083 -0.551810 -0.509277 -0.201686 -0.442151 -0.370341 -0.205166 -0.205989 -0.118902 0.238577 0.231213 0.257211 0.255264 0.253356 0.277422 0.241323 0.242540 0.239720 0.250235 0.255485 0.255442
chargesum: 0.00000
title: Mulliken charges with hydrogens summed into heavy atoms:
elementType: Cl O O N C C C C C C C C C C C C C C C C C
charge: -0.059587 -0.260038 -0.260994 0.012191 0.293162 0.425319 0.258427 -0.254940 0.002360 0.149595 -0.137412 0.522534 -0.100819 -0.298454 -0.231855 0.282176 -0.202431 -0.120105 0.050319 0.049453 -0.118902
polarizability: 2.59785206e+02 1.79681477e+00 2.08032817e+02 -2.11650715e+01 -1.23123716e+01 1.52137533e+02
1716.lowfreq: -43.7824 -6.6975 -0.0013 -0.0004 0.0013 4.8720 11.9317 21.9257 28.9745
frequency: -43.7796 21.8231 28.9034 37.1335 87.3735 107.7247 124.9860 185.4482 202.0969 224.3602 256.4247 272.9927 284.6214 306.8450 337.0502 392.4642 409.4670 433.0823 450.9309 473.1495 488.5499 513.3052 526.2635 572.9804 601.0388 624.7250 642.8518 654.2628 681.2311 699.6818 714.8472 722.9108 759.8121 789.4851 810.8331 825.5923 828.5372 833.1580 837.4632 885.3978 901.9668 927.9574 936.8232 942.4888 958.3782 969.4891 973.9755 996.1796 1000.2698 1064.0200 1072.8719 1102.5850 1113.3998 1119.4635 1124.6340 1142.1991 1184.4965 1190.7874 1205.1812 1241.5500 1261.5421 1270.9400 1289.8335 1311.5316 1347.0214 1361.1989 1376.8395 1385.4683 1397.5629 1398.0362 1412.6896 1453.8404 1465.2063 1478.6520 1484.6884 1511.3222 1553.2860 1574.8261 1587.3600 1600.5615 1642.1462 2973.8149 3016.2801 3021.3252 3096.7056 3122.8977 3123.2579 3136.9716 3137.1046 3165.6222 3166.8645 3169.9427 3186.1184
redmass: 2.2894 7.2891 4.9933 5.7113 7.6124 8.0519 8.0917 6.7318 4.7203 5.1548 4.9017 6.5956 6.6341 4.7562 2.8277 7.5832 2.8986 5.8898 5.4232 4.4794 3.4222 4.8146 5.9960 3.8511 5.6726 7.0272 6.2726 5.2512 4.2563 8.5241 5.0416 6.1364 2.6036 3.0705 1.6281 7.5704 1.8903 1.3004 4.7468 3.7142 1.8999 1.6390 1.4553 1.3776 1.9172 1.9625 1.9186 5.9713 4.3507 1.4581 2.7772 1.9041 2.2709 1.0374 3.7106 1.4302 1.1222 1.4156 2.1209 1.8534 2.2935 1.9387 1.4887 1.6918 2.2257 1.5461 6.0088 1.9616 3.8481 3.0434 2.4303 4.2336 1.1988 2.0484 1.1350 4.9827 5.7258 8.0177 7.3406 6.1992 8.9702 1.0598 1.0534 1.1000 1.1193 1.0910 1.0899 1.0917 1.0906 1.0878 1.0950 1.0962 1.0971
irintensity: 14.3501 0.4606 0.1343 0.9003 0.0153 0.1635 0.1095 0.8581 0.1327 0.4135 0.6373 0.2707 0.1495 2.2920 0.7736 9.5610 0.0653 3.2005 4.1372 5.0402 19.4409 7.5697 8.0010 7.9011 1.9532 0.3866 6.0447 13.7521 4.2950 1.1122 5.3246 11.0301 4.7159 8.9352 48.6216 24.3624 46.8134 5.6851 9.0930 7.6557 21.1011 6.9033 1.1434 0.3439 10.7516 23.1878 23.9202 161.8140 38.8483 4.2662 37.6990 5.3432 7.8232 0.0276 45.2297 1.4823 1.3224 2.5656 3.7285 76.7810 34.8714 99.5385 7.8076 1.3473 0.8993 27.2211 1.8184 116.1939 13.6232 16.5188 47.0115 25.8005 38.1435 67.7027 0.2309 18.2374 60.1900 11.6221 2.5929 4.1855 11.6460 26.0389 127.2336 9.1617 28.8980 28.3947 11.3228 0.1331 7.1551 1.8669 6.4349 0.6793 4.3523
temp: 298.150 k
press: 1.00000 atm
elementType: 17 8 8 7 6 6 6 6 6 6 6 6 6 6 6 6 6 6 6 6 6 1 1 1 1 1 1 1 1 1 1 1 1
symmnumber: 1
zpe: 641796.4 jmol-1
zpe.correction: 0.244447 hartree
zpe.thermalcorrener: 0.260525 hartree
zpe.thermalcorrenthalpy: 0.261469 hartree
zpe.thermalcorrgfe: 0.198582 hartree
zpe.sumelectzpe: -1318.796179 hartree
zpe.sumelectthermal: -1318.780101 hartree
zpe.sumelectthermalent: -1318.779157 hartree
zpe.sumelectthermalfe: -1318.842044 hartree
dipole: 1.4265 -1.6633 2.0591
dipole: 3.0069
quadrupole: -127.7509 -135.5839 -121.7800
quadrupole: -16.0404 -6.6429 4.1320
quadrupole: 0.6207 -7.2123 6.5916 -16.0404 -6.6429 4.1320
hfenergy: -1319.0406259 hartree
pointgroup: C01 [X(C17H12Cl1N1O2)]
dipole: 0.7073271 -0.7582738 0.569371 debye
polarizability: 255.2393329|16.1643444|214.295429|-21.0537139|2.4747364|150.420794 unknown
InChI: InChI=1S/C17H12ClNO2/c18-13-3-1-11(2-4-13)7-12-8-19-9-15-14(12)5-6-16-17(15)21-10-20-16/h1-6,8-9H,7,10H2
charge 0 multiplicity 1
33 atoms
Cl -5.548586 -2.324137 -1.46512
O  4.233416 0.316878 -1.124348
O  4.000066 -2.027499 -0.635044
N  1.172576 3.297062 -0.032541
C  0.836664 0.491895 0.567629
C  -0.171415 1.459507 0.939403
C  2.019425 1.005577 -0.11182
C  -1.44133 1.060939 1.67717
C  3.00961 0.058267 -0.461493
C  2.873159 -1.29961 -0.177385
C  0.725802 -0.911936 0.840683
C  -2.428194 0.201371 0.880177
C  1.736059 -1.819022 0.475047
C  0.052717 2.805414 0.621674
C  2.120934 2.411492 -0.382665
C  4.907221 -1.010411 -1.235386
C  -3.158316 -0.829486 1.52316
C  -2.669862 0.444421 -0.49556
C  -4.110755 -1.60243 0.820769
C  -3.616207 -0.317005 -1.216293
C  -4.32414 -1.331461 -0.543518
H  -1.957709 1.990667 1.988852
H  -1.180925 0.530018 2.614132
H  -0.173567 -1.292937 1.330777
H  1.649939 -2.888941 0.680386
H  -0.689072 3.564896 0.8964
H  3.004828 2.804896 -0.896867
H  5.848904 -0.981586 -0.660614
H  5.058075 -1.245653 -2.302414
H  -2.989247 -1.034234 2.587574
H  -2.110739 1.231755 -1.01343
H  -4.670898 -2.39642 1.323038
H  -3.797734 -0.125588 -2.277973
