program: Orca
programVersion: 5.0.3
elementType: C N C C N C C C C C N C C C C C N C C N C C H H H H H H H H H H H H H H H H H H H H H H H H H H H
charge: 2
multiplicity: 1
keywords: SP DLPNO-CCSD(T) aug-cc-pVTZ aug-cc-pVTZ/C TightSCF CPCM(Acetonitrile)
formula: C17H27N5
InChI: InChI=1S/C17H27N5/c1-18(2)15-7-11-21(12-8-15)16-9-13-22(14-10-16)17(19(3)4)20(5)6/h7-14,16H,1-6H3
49 atoms
C  -5.14964 -0.902929 1.73955
N  -4.21295 0.084301 1.22249
C  -4.31891 1.410491 1.81817
C  -3.33628 -0.201949 0.27438
N  -2.1310 0.457211 0.26651
C  -1.40757 0.649061 1.4438
C  -0.22254 1.252231 1.45793
C  0.45044 1.747591 0.22086
C  -0.43672 1.595901 -0.96956
C  -1.60912 0.971121 -0.9209
N  1.73175 1.010281 0.0020
C  1.71961 -0.323169 -0.19224
C  2.85903 -1.032849 -0.40288
C  4.11968 -0.377209 -0.42729
C  4.09066 1.026171 -0.21634
C  2.90762 1.665071 -0.01096
N  5.25454 -1.036609 -0.63514
C  6.52135 -0.324959 -0.6575
C  5.24271 -2.475919 -0.83468
N  -3.56985 -1.095479 -0.67263
C  -2.50899 -1.888729 -1.28057
C  -4.90671 -1.355399 -1.18746
H  -5.1501 -0.825109 2.82595
H  -4.83826 -1.908339 1.47243
H  -6.16176 -0.723859 1.37808
H  -3.73688 2.139541 1.26263
H  -3.98945 1.396411 2.85659
H  -5.36461 1.715141 1.78791
H  -1.85619 0.257331 2.34525
H  0.2880 1.369951 2.40385
H  0.75667 2.789631 0.33924
H  -0.11255 2.018471 -1.91048
H  -2.24238 0.884541 -1.79253
H  0.75669 -0.813739 -0.17658
H  2.76586 -2.097509 -0.55163
H  4.98946 1.623041 -0.21094
H  2.8684 2.732761 0.15124
H  6.53602 0.437031 -1.43777
H  7.3205 -1.028779 -0.86285
H  6.72865 0.151511 0.30204
H  4.66661 -2.751819 -1.71912
H  4.8274 -2.995189 0.03031
H  6.26058 -2.823419 -0.9754
H  -2.33529 -1.580269 -2.31115
H  -1.58415 -1.808929 -0.71728
H  -2.82048 -2.932569 -1.27722
H  -5.30389 -2.300719 -0.8190
H  -4.84015 -1.407399 -2.27345
H  -5.58552 -0.547589 -0.93023
elementType: C N H
totalener: -931.75338434 hartree
nucrepener: 1846.33120622 hartree
electener: -2778.08459056 hartree
oneelecener: -4891.38687207 hartree
twoeener: 2113.30228151 hartree
cpcmener: -0.22703524 hartree
kineticenergy: 930.67423245 hartree
chargesum: 2.0000000
charge: -1.125182 0.265250 -1.175824 0.701288 -0.081099 0.213700 -1.065889 0.201499 -1.081727 0.530131 -0.152546 -0.092732 -0.704876 0.833214 -0.000463 -0.085479 -0.354092 -1.155935 -1.156058 0.319495 -1.231861 -1.150636 0.206565 0.384518 0.394563 0.410163 0.420219 0.218989 0.582949 0.102912 0.512222 0.040920 0.546473 1.862975 -0.720782 -0.377038 0.632905 0.349596 0.363471 0.352247 0.382411 0.376142 0.372290 0.389232 0.611528 0.180117 0.389621 0.187388 0.377227
charge: 0.545475 0.299521 0.548125 -0.367632 0.264435 0.169762 0.292860 -0.078281 0.291383 0.166785 0.285170 0.185829 0.303706 -0.179452 0.298708 0.205293 0.276280 0.528506 0.528637 0.300741 0.549717 0.545773 -0.135928 -0.153636 -0.138186 -0.151614 -0.138496 -0.134208 -0.145743 -0.155421 -0.131525 -0.154943 -0.141514 -0.136698 -0.182422 -0.184146 -0.122787 -0.144839 -0.162938 -0.142299 -0.143357 -0.143792 -0.162865 -0.137166 -0.156924 -0.133379 -0.138251 -0.136168 -0.152098
qa: -1.1252 0.2652 -1.1758 0.7013 -0.0811 0.2137 -1.0659 0.2015 -1.0817 0.5301 -0.1525 -0.0927 -0.7049 0.8332 -0.0005 -0.0855 -0.3541 -1.1559 -1.1561 0.3195 -1.2319 -1.1506 0.2066 0.3845 0.3946 0.4102 0.4202 0.2190 0.5829 0.1029 0.5122 0.0409 0.5465 1.8630 -0.7208 -0.3770 0.6329 0.3496 0.3635 0.3522 0.3824 0.3761 0.3723 0.3892 0.6115 0.1801 0.3896 0.1874 0.3772
va: 3.6014 3.1080 3.5616 1.5089 2.8294 2.1842 3.5905 3.6099 3.6294 1.7440 2.7487 -1.5472 1.8379 2.7867 2.1228 1.3571 1.4833 3.5960 3.5577 3.1640 3.4708 3.6376 1.1748 0.9998 0.9694 0.9933 0.9243 1.1537 0.1820 1.3021 0.4290 1.3989 0.1757 -4.0019 1.6434 1.6241 0.0618 1.0061 0.9826 1.0046 0.9597 0.9696 0.9652 0.9489 0.7642 1.1772 0.9738 1.2021 1.0138
e0: -931.753384461 hartree
corrType: DLPNO BASED
energy: -935.889840545550
dipole: -6.73047 5.12139 -1.60908 -8.47479 7.97974 -0.49506 -0.75902 0.81943 0.06041
magnitude: 1.68460 au
magnitude: 4.28192 debye
