program: Orca
programVersion: 5.0.3
elementType: C Si C C F H H H H H H H H H
charge: 0
multiplicity: 1
keywords: Freq PBEh-3c RIJCOSX CPCM(CH2Cl2)
frequency: 0.00 0.00 0.00 0.00 0.00 0.00 131.78 148.28 150.45 180.49 180.93 223.21 264.31 266.93 591.19 678.54 680.08 683.62 757.50 758.51 767.61 847.09 847.73 880.72 1278.13 1278.21 1279.19 1415.56 1417.28 1417.70 1422.84 1423.10 1429.70 2955.79 2956.20 2956.50 3036.40 3037.24 3038.67 3045.44 3045.76 3046.10
frequency: 131.78 148.28 150.45 180.49 180.93 223.21 264.31 266.93 591.19 678.54 680.08 683.62 757.50 758.51 767.61 847.09 847.73 880.72 1278.13 1278.21 1279.19 1415.56 1417.28 1417.70 1422.84 1423.10 1429.70 2955.79 2956.20 2956.50 3036.40 3037.24 3038.67 3045.44 3045.76 3046.10
formula: C3H9FSi
InChI: InChI=1S/C3H9FSi/c1-5(2,3)4/h1-3H3
14 atoms
C  -1.226712 -1.299928 -0.021416
Si 0.101705 -0.032625 -0.370899
C  -0.510058 1.709317 -0.076592
C  1.658066 -0.384029 0.604006
F  0.475627 -0.155168 -1.963895
H  -0.877478 -2.315139 -0.216171
H  -2.119414 -1.130365 -0.625084
H  -1.528904 -1.256437 1.026923
H  0.251043 2.453707 -0.315369
H  -1.396862 1.935032 -0.6708
H  -0.77936 1.845877 0.972864
H  2.054552 -1.379368 0.398643
H  1.452741 -0.331364 1.675368
H  2.445154 0.34069 0.389624
elementType: C Si F H
totalener: -508.38483979 hartree
nucrepener: 249.38551280 hartree
electener: -757.77035259 hartree
oneelecener: -1196.42663478 hartree
twoeener: 438.65628219 hartree
cpcmener: -0.00484938 hartree
kineticenergy: 506.06716481 hartree
exchangeener: -27.502785485333 hartree
correlationener: -2.253531512581 hartree
xcener: -29.756316997913 hartree
energy: -1816.7820 -682.0231 -283.3194 -283.3162 -283.3117 -150.5215 -104.1159 -103.9998 -103.9991 -34.7607 -21.7140 -20.7368 -20.7355 -15.6859 -13.4651 -13.4647 -13.1301 -12.5002 -12.4920 -12.0072 -11.9050 -11.9022 -11.8328 -9.4782 -9.4754 2.8349 3.1474 3.9799 3.9832 5.1137 5.1215 5.7822 6.1310 6.1332 6.4051 6.9612 6.9895 6.9932 10.0601 12.4001 12.4020 13.3796 13.3823 14.2377 15.5813 15.5876 16.0497 17.4499 17.4579 17.8365 18.8909 18.8924 19.7463 23.4693 24.6111 24.6167 27.6354 27.7479 27.7552 28.2529 29.0220 29.0255 29.1849 30.3561 30.3590 33.2138 33.2398 35.0296 35.9007 35.9126 36.3182 37.8921 37.8961 41.5207 41.5570 46.8972 47.9513 51.0107 51.0316 51.6901 52.2295 52.2891 58.2403 61.5104 61.5205 63.6833 63.6907 63.7014 63.7825 65.0102 65.0529 79.1907 372.8178 374.2462 374.2608 891.8157 electronvolt
chargesum: -0.0000000
charge: -0.991334 1.196993 -0.991916 -0.992114 -0.475013 0.250594 0.250847 0.249337 0.250914 0.250795 0.249469 0.251103 0.249622 0.250702
charge: -0.581906 0.659206 -0.582068 -0.582080 -0.291340 0.152491 0.152523 0.154273 0.152517 0.152464 0.154402 0.152508 0.154637 0.152373
qa: -0.9913 1.1970 -0.9919 -0.9921 -0.4750 0.2506 0.2508 0.2493 0.2509 0.2508 0.2495 0.2511 0.2496 0.2507
va: 3.6704 3.8003 3.6700 3.6696 0.9390 0.9011 0.9012 0.9009 0.9011 0.9011 0.9008 0.9011 0.9007 0.9011
dispcorr: -0.005559428 hartree
energy: -508.377797968273
dipole: -1.75938 1.55823 -0.20116 0.57299 -0.50490 0.06808 7.46912 -6.59821 0.87090
magnitude: 0.89642 au
magnitude: 2.27853 debye
temp: 298.15 k
press: 1.00 atm
zeropoint: 0.11053396 hartree
thermalvibcorrection: 0.00566814 hartree
thermalrotcorrection: 0.00141627 hartree
thermaltrasncorrection: 0.00141627 hartree
thermaltotal: -508.25876333 hartree
thermalcorr: 0.00850068 hartree
nonthermalcorr: 0.11053396 hartree
totalcorr: 0.11903464 hartree
thermalcorrenthalpy: 0.00094421 hartree
totalenthalpy: -508.25781912 hartree
totalentropycorr: -0.04130031 hartree
gibbsenthalpy: -508.29911943 hartree
gibbsminuselec: 0.07867854 hartree
