program: Orca
programVersion: 5.0.3
elementType: C N C F N C C C H H H H H H H H H H H H
charge: 1
multiplicity: 1
keywords: Freq PBEh-3c RIJCOSX
frequency: 0.00 0.00 0.00 0.00 0.00 0.00 97.98 120.45 125.05 128.23 181.62 222.43 249.86 266.79 301.25 340.44 372.02 390.86 520.62 548.67 693.08 716.92 886.66 1037.93 1056.57 1057.39 1091.70 1097.88 1134.77 1135.29 1175.60 1208.79 1229.93 1296.72 1424.88 1429.81 1435.96 1445.38 1449.46 1458.79 1465.73 1467.07 1472.67 1479.62 1483.16 1489.01 1567.98 1743.10 2982.66 2984.85 2986.35 2987.14 3063.79 3064.66 3070.25 3072.12 3097.66 3098.61 3105.88 3106.71
frequency: 97.98 120.45 125.05 128.23 181.62 222.43 249.86 266.79 301.25 340.44 372.02 390.86 520.62 548.67 693.08 716.92 886.66 1037.93 1056.57 1057.39 1091.70 1097.88 1134.77 1135.29 1175.60 1208.79 1229.93 1296.72 1424.88 1429.81 1435.96 1445.38 1449.46 1458.79 1465.73 1467.07 1472.67 1479.62 1483.16 1489.01 1567.98 1743.10 2982.66 2984.85 2986.35 2987.14 3063.79 3064.66 3070.25 3072.12 3097.66 3098.61 3105.88 3106.71
formula: C5H12FN2
InChI: InChI=1S/C5H12FN2/c1-7(2)5(6)8(3)4/h1-4H3
20 atoms
C  -1.552749 1.093994 -0.257117
N  -1.10365 -0.112473 0.433549
C  0.029895 -0.711353 0.173697
F  0.084317 -1.981309 0.48524
N  1.117193 -0.212667 -0.356296
C  1.463259 1.205424 -0.297712
C  2.150773 -1.08375 -0.925575
C  -2.082866 -0.700004 1.353963
H  -2.597265 0.952094 -0.529028
H  -0.995671 1.260053 -1.173872
H  -1.479634 1.971272 0.383822
H  1.326372 1.691111 -1.2624
H  2.513198 1.279614 -0.019657
H  0.886191 1.723627 0.461647
H  1.752269 -2.051286 -1.211609
H  2.962681 -1.223054 -0.213208
H  2.541333 -0.602026 -1.8191
H  -1.623222 -1.404938 2.038249
H  -2.519506 0.105581 1.940321
H  -2.872816 -1.199811 0.795088
totalener: -406.03306542 hartree
nucrepener: 427.84011528 hartree
electener: -833.87318070 hartree
oneelecener: -1388.45666118 hartree
twoeener: 554.58348048 hartree
kineticenergy: 403.08492907 hartree
exchangeener: -29.712245362431 hartree
correlationener: -2.802477710588 hartree
xcener: -32.514723073018 hartree
energy: -689.2748 -405.1486 -405.1329 -294.5284 -289.7491 -289.7461 -289.4957 -289.4880 -43.2889 -35.4103 -33.8322 -27.9343 -27.1473 -26.9353 -25.7993 -23.4915 -21.7166 -21.6538 -21.4636 -19.2815 -19.1712 -19.1595 -19.1130 -18.5612 -17.8245 -17.3989 -17.2047 -17.0803 -16.7528 -16.4667 -15.2719 -13.0937 -4.2087 -1.2908 -0.8487 -0.3296 -0.0219 0.1771 0.7453 0.7611 1.0111 1.2860 1.3451 1.6114 1.7145 1.9568 2.3341 2.9226 3.1848 3.3182 5.2825 7.0927 7.5984 7.9393 8.5998 9.1610 9.5752 9.8218 10.3055 11.4984 11.6245 12.5942 12.6547 12.9057 13.1238 13.3426 14.6802 17.0715 19.3007 19.4998 20.8612 21.3532 21.4047 22.4012 22.6688 22.8639 23.2344 23.5110 23.7202 23.8893 24.2470 24.6432 24.7262 25.0627 25.6787 26.1034 27.0177 28.4064 28.7686 29.0686 29.5448 30.8282 32.5078 32.8865 33.0180 34.7323 34.8764 35.8825 36.0925 39.8537 40.1086 41.2134 43.5757 45.4823 47.6001 48.3928 48.7069 49.4762 49.7584 50.3911 50.5305 51.7418 52.6334 52.6757 53.4774 54.0493 55.1519 56.9922 57.6055 57.8254 58.2856 58.7748 59.1941 61.4134 61.5149 62.4170 63.1169 64.3618 66.9584 67.1256 69.7378 71.7976 72.5461 76.6172 81.6694 84.1239 367.3902 369.0706 370.7269 371.6985 377.2744 520.4440 523.2644 888.5013 electronvolt
chargesum: 1.0000000
charge: -0.547342 -0.456983 0.933879 -0.239036 -0.457433 -0.547418 -0.534196 -0.533552 0.299018 0.270346 0.277157 0.276747 0.299238 0.270136 0.284054 0.282968 0.277650 0.284274 0.277502 0.282993
charge: -0.239426 -0.072770 0.290593 -0.068325 -0.073780 -0.239368 -0.237280 -0.237001 0.162673 0.152580 0.150777 0.150471 0.162768 0.152478 0.160590 0.155636 0.156462 0.160707 0.156449 0.155767
qa: -0.5473 -0.4570 0.9339 -0.2390 -0.4574 -0.5474 -0.5342 -0.5336 0.2990 0.2703 0.2772 0.2767 0.2992 0.2701 0.2841 0.2830 0.2777 0.2843 0.2775 0.2830
va: 3.5829 3.2226 3.7309 1.1918 3.2204 3.5837 3.5860 3.5850 0.8800 0.8953 0.8852 0.8854 0.8799 0.8953 0.8961 0.8833 0.8875 0.8963 0.8875 0.8834
dispcorr: -0.009801556 hartree
energy: -406.001831602321
dipole: -0.33244 0.29329 -0.03915 7.82886 -6.99851 0.83035 -1.91117 1.71057 -0.20059
magnitude: 0.85513 au
magnitude: 2.17356 debye
temp: 298.15 k
press: 1.00 atm
zeropoint: 0.17341140 hartree
thermalvibcorrection: 0.00731787 hartree
thermalrotcorrection: 0.00141627 hartree
thermaltrasncorrection: 0.00141627 hartree
thermaltotal: -405.81826979 hartree
thermalcorr: 0.01015042 hartree
nonthermalcorr: 0.17341140 hartree
totalcorr: 0.18356182 hartree
thermalcorrenthalpy: 0.00094421 hartree
totalenthalpy: -405.81732558 hartree
totalentropycorr: -0.04540827 hartree
gibbsenthalpy: -405.86273385 hartree
gibbsminuselec: 0.13909775 hartree
