program: Orca
programVersion: 5.0.3
elementType: F C C F C F C F C F C B C C F C F C F C F C F C C F C F C F C F C F
charge: 0
multiplicity: 1
keywords: Freq PBEh-3c RIJCOSX
frequency: 0.00 0.00 0.00 0.00 0.00 0.00 10.54 18.29 24.21 31.15 31.45 35.50 97.81 104.91 107.16 124.92 126.97 128.57 134.62 144.35 152.95 160.28 165.42 166.47 226.12 228.99 233.41 269.00 270.28 271.15 272.39 272.74 277.58 305.06 307.44 310.85 336.11 337.33 346.47 356.48 384.34 390.38 409.07 409.44 410.92 432.48 432.82 433.13 465.06 465.50 489.20 546.18 568.55 568.74 571.24 625.43 627.39 657.17 658.72 659.81 661.16 662.64 664.41 710.73 712.77 714.81 770.37 772.32 783.54 854.47 988.51 989.19 991.62 1027.69 1029.04 1124.45 1168.63 1169.70 1170.82 1184.01 1191.70 1285.44 1287.72 1288.11 1324.46 1339.28 1342.33 1409.27 1417.82 1425.89 1509.85 1515.59 1518.05 1542.97 1543.29 1543.98 1643.89 1647.20 1648.80 1662.39 1665.40 1667.57
frequency: 10.54 18.29 24.21 31.15 31.45 35.50 97.81 104.91 107.16 124.92 126.97 128.57 134.62 144.35 152.95 160.28 165.42 166.47 226.12 228.99 233.41 269.00 270.28 271.15 272.39 272.74 277.58 305.06 307.44 310.85 336.11 337.33 346.47 356.48 384.34 390.38 409.07 409.44 410.92 432.48 432.82 433.13 465.06 465.50 489.20 546.18 568.55 568.74 571.24 625.43 627.39 657.17 658.72 659.81 661.16 662.64 664.41 710.73 712.77 714.81 770.37 772.32 783.54 854.47 988.51 989.19 991.62 1027.69 1029.04 1124.45 1168.63 1169.70 1170.82 1184.01 1191.70 1285.44 1287.72 1288.11 1324.46 1339.28 1342.33 1409.27 1417.82 1425.89 1509.85 1515.59 1518.05 1542.97 1543.29 1543.98 1643.89 1647.20 1648.80 1662.39 1665.40 1667.57
formula: C18BF15
InChI: InChI=1S/C18BF15/c20-4-1(5(21)11(27)16(32)10(4)26)19(2-6(22)12(28)17(33)13(29)7(2)23)3-8(24)14(30)18(34)15(31)9(3)25
34 atoms
F  -1.789577 0.06151 2.078239
C  -1.868273 -1.011152 1.295264
C  -2.77986 -1.992073 1.633302
F  -3.554798 -1.863349 2.699818
C  -2.870987 -3.123665 0.841326
F  -3.749264 -4.063832 1.138269
C  -2.044366 -3.275471 -0.260598
F  -2.140113 -4.363952 -1.009685
C  -1.129548 -2.283699 -0.554357
F  -0.357098 -2.437158 -1.625947
C  -1.015898 -1.130361 0.207477
B  0.02773 -0.014621 -0.110776
C  1.519824 -0.372826 -0.366008
C  2.137475 -1.446784 0.271261
F  1.445379 -2.217064 1.101743
C  3.479455 -1.735134 0.111746
F  4.042128 -2.749423 0.752063
C  4.242127 -0.943323 -0.729858
F  5.524061 -1.204295 -0.89712
C  3.666501 0.126049 -1.396947
F  4.40774 0.876641 -2.198217
C  2.326677 0.394169 -1.203216
F  1.803441 1.417555 -1.867373
C  -0.457442 1.46763 -0.093464
C  -1.680886 1.835649 -0.640013
F  -2.412789 0.934401 -1.286954
C  -2.167982 3.126119 -0.569246
F  -3.337389 3.44594 -1.103407
C  -1.418083 4.092759 0.078984
F  -1.872454 5.329149 0.162215
C  -0.193058 3.768326 0.638092
F  0.51177 4.6972 1.266936
C  0.268839 2.471109 0.535232
F  1.436717 2.183878 1.101624
totalener: -2203.96440846 hartree
nucrepener: 3855.07274325 hartree
electener: -6059.03715171 hartree
twoeener: 4669.28789579 hartree
kineticenergy: 2190.84400406 hartree
exchangeener: -139.027003415914 hartree
correlationener: -11.484205580152 hartree
xcener: -150.511208996066 hartree
chargesum: -0.0000000
charge: -0.283948 0.397990 0.270805 -0.275488 0.277735 -0.271743 0.265141 -0.275748 0.411834 -0.283652 -0.533120 0.842003 -0.506398 0.394716 -0.279341 0.272699 -0.274525 0.283409 -0.268158 0.269767 -0.274401 0.404424 -0.279890 -0.523957 0.402046 -0.281640 0.269719 -0.275158 0.279433 -0.270478 0.269895 -0.275251 0.405101 -0.283822
charge: -0.118268 0.159839 0.105719 -0.114636 0.133147 -0.104427 0.105992 -0.114830 0.160442 -0.117728 -0.154160 0.133662 -0.160238 0.168467 -0.111873 0.104002 -0.113951 0.140283 -0.100069 0.104521 -0.113733 0.167524 -0.111377 -0.156250 0.162642 -0.115717 0.105238 -0.114460 0.135561 -0.102889 0.105416 -0.114519 0.162821 -0.116149
qa: -0.2839 0.3980 0.2708 -0.2755 0.2777 -0.2717 0.2651 -0.2757 0.4118 -0.2837 -0.5331 0.8420 -0.5064 0.3947 -0.2793 0.2727 -0.2745 0.2834 -0.2682 0.2698 -0.2744 0.4044 -0.2799 -0.5240 0.4020 -0.2816 0.2697 -0.2752 0.2794 -0.2705 0.2699 -0.2753 0.4051 -0.2838
va: 1.1381 3.7765 3.8080 1.1340 3.7567 1.1361 3.8072 1.1331 3.7778 1.1393 3.6869 2.8194 3.6772 3.7883 1.1423 3.8034 1.1343 3.7589 1.1416 3.8048 1.1346 3.7847 1.1423 3.6865 3.7787 1.1409 3.8078 1.1341 3.7576 1.1381 3.8056 1.1339 3.7787 1.1380
dispcorr: -0.027485015 hartree
energy: -2203.915015446499
dipole: 0.00877 0.14815 0.15692 -0.02277 0.03134 0.00856 -0.13914 0.08319 -0.05595
magnitude: 0.16682 au
magnitude: 0.42401 debye
temp: 298.15 k
press: 1.00 atm
zeropoint: 0.15301180 hartree
thermalvibcorrection: 0.02635089 hartree
thermalrotcorrection: 0.00141627 hartree
thermaltrasncorrection: 0.00141627 hartree
thermaltotal: -2203.73282022 hartree
thermalcorr: 0.02918343 hartree
nonthermalcorr: 0.15301180 hartree
totalcorr: 0.18219522 hartree
thermalcorrenthalpy: 0.00094421 hartree
totalenthalpy: -2203.73187601 hartree
totalentropycorr: -0.08674026 hartree
gibbsenthalpy: -2203.81861627 hartree
gibbsminuselec: 0.09639918 hartree
