program: Orca
programVersion: 5.0.3
elementType: C N C C N C C C C C C C C C C N N C C H H H H H H H H H H H H H H H H H H H H
charge: 2
multiplicity: 1
keywords: SP DLPNO-CCSD(T) aug-cc-pVTZ aug-cc-pVTZ/C TightSCF CPCM(Acetonitrile)
formula: C15H20N4
InChI: InChI=1S/C15H20N4/c1-16(2)15(17(3)4)18-11-7-5-9-13(18)14-10-6-8-12-19(14)15/h5-12H,1-4H3
39 atoms
C  -1.417451 0.929856 -1.98832
N  -1.86215 0.321566 -0.740552
C  -2.994382 -0.575798 -0.963242
C  -0.885497 -0.070381 0.174843
N  0.102142 1.087329 0.339017
C  -0.244796 2.28184 0.816155
C  0.734873 3.237245 0.989764
C  2.049587 2.938679 0.658983
C  2.377226 1.689077 0.146062
C  1.361219 0.777831 -0.00325
C  1.364238 -0.578068 -0.516606
C  2.37146 -1.332292 -1.065839
C  2.058725 -2.623941 -1.472756
C  0.771052 -3.116844 -1.310604
C  -0.199887 -2.314022 -0.748797
N  0.125613 -1.075552 -0.381007
N  -1.380438 -0.570866 1.380239
C  -2.430951 0.194512 2.049869
C  -0.418984 -1.091175 2.344889
H  -0.917723 0.21745 -2.653744
H  -2.298393 1.303952 -2.504874
H  -0.761852 1.782058 -1.827237
H  -3.858118 0.026274 -1.240906
H  -2.798597 -1.279782 -1.77776
H  -3.246774 -1.14277 -0.072777
H  -1.289587 2.458782 1.024206
H  0.458804 4.207639 1.374256
H  2.822696 3.682259 0.793134
H  3.390615 1.435515 -0.130822
H  3.367484 -0.926598 -1.172215
H  2.824849 -3.246568 -1.912985
H  0.512213 -4.121426 -1.609696
H  -1.211077 -2.649151 -0.568917
H  -2.010859 0.927447 2.745332
H  -3.068794 0.716779 1.343767
H  -3.04766 -0.49703 2.621516
H  0.204411 -0.305746 2.78593
H  0.224275 -1.85742 1.92011
H  -0.980571 -1.560117 3.149473
elementType: C N H
totalener: -797.42767746 hartree
nucrepener: 1571.08723815 hartree
electener: -2368.51491560 hartree
oneelecener: -4162.65011861 hartree
twoeener: 1794.13520300 hartree
cpcmener: -0.25116105 hartree
kineticenergy: 796.49625551 hartree
chargesum: 2.0000000
charge: -1.206532 -0.258284 -1.330613 1.628416 1.150300 -0.099138 -0.717595 -0.682783 -1.250826 0.873474 0.804261 -1.249553 -0.692064 -0.698233 -0.129662 1.240029 -0.290013 -1.335921 -1.214875 0.357788 0.250013 0.431218 0.337122 0.288831 0.405352 0.284501 0.496066 0.831291 0.053290 0.058931 0.821569 0.506010 0.261252 0.288591 0.401237 0.351133 0.363265 0.425236 0.246916
charge: 0.518541 0.293230 0.507308 -0.608719 0.325431 0.230730 0.318382 0.310472 0.337049 -0.120258 -0.119700 0.337116 0.310638 0.317906 0.230944 0.325251 0.293870 0.506036 0.518030 -0.131533 -0.143532 -0.162936 -0.138395 -0.140194 -0.173361 -0.117377 -0.146844 -0.128787 -0.134893 -0.134806 -0.128866 -0.146900 -0.115153 -0.140500 -0.172415 -0.137421 -0.131485 -0.163511 -0.143349
qa: -1.2065 -0.2583 -1.3306 1.6284 1.1503 -0.0991 -0.7176 -0.6828 -1.2508 0.8735 0.8043 -1.2496 -0.6921 -0.6982 -0.1297 1.2400 -0.2900 -1.3359 -1.2149 0.3578 0.2500 0.4312 0.3371 0.2888 0.4054 0.2845 0.4961 0.8313 0.0533 0.0589 0.8216 0.5060 0.2613 0.2886 0.4012 0.3511 0.3633 0.4252 0.2469
va: 3.4542 2.4367 3.5006 0.4368 1.1796 3.4516 2.2217 3.4087 2.7582 2.8875 2.9004 2.7078 3.4324 2.2004 3.4925 0.9101 2.3208 3.4907 3.4512 0.9997 1.0661 0.9430 1.0369 1.1087 0.9656 0.8799 0.9167 -0.1819 1.4058 1.3989 -0.1586 0.8959 0.9039 1.1122 0.9730 1.0094 0.9890 0.9520 1.0685
e0: -797.427677392 hartree
corrType: DLPNO BASED
energy: -800.922847581138
dipole: -10.97885 12.75240 1.77355 -0.77854 0.92119 0.14265 2.14776 -2.50805 -0.36029
magnitude: 1.81539 au
magnitude: 4.61435 debye
