program: Orca
programVersion: 5.0.3
elementType: C N C C N C C C C C C C C C C N N C C H H H H H H H H H H H H H H H H H H H H
charge: 2
multiplicity: 1
keywords: Freq PBEh-3c RIJCOSX CPCM(Acetonitrile)
frequency: 0.00 0.00 0.00 0.00 0.00 0.00 19.34 78.79 85.52 107.19 125.85 155.53 166.91 174.51 197.22 203.16 212.30 222.07 278.51 301.63 304.75 346.39 370.97 408.16 412.17 414.80 448.79 451.59 473.23 517.31 530.27 562.12 599.79 617.42 670.13 686.80 729.31 761.04 808.31 811.30 819.46 835.03 883.22 946.48 955.81 960.86 964.16 1036.63 1039.46 1076.76 1081.54 1081.95 1084.72 1101.82 1105.17 1110.75 1111.79 1133.24 1142.79 1159.62 1161.03 1181.62 1184.96 1200.41 1206.51 1218.17 1219.18 1223.42 1285.74 1312.66 1331.51 1357.30 1383.43 1387.18 1399.13 1426.09 1462.27 1498.36 1500.62 1523.42 1524.73 1526.11 1535.65 1536.79 1539.64 1544.69 1546.28 1550.28 1550.70 1563.71 1565.65 1568.47 1612.72 1699.86 1703.01 1740.32 1742.51 3094.80 3095.83 3099.85 3104.24 3194.68 3195.75 3202.50 3203.74 3240.90 3242.75 3256.83 3259.68 3307.04 3308.80 3315.64 3318.64 3321.52 3323.80 3330.52 3332.81
frequency: 19.34 78.79 85.52 107.19 125.85 155.53 166.91 174.51 197.22 203.16 212.30 222.07 278.51 301.63 304.75 346.39 370.97 408.16 412.17 414.80 448.79 451.59 473.23 517.31 530.27 562.12 599.79 617.42 670.13 686.80 729.31 761.04 808.31 811.30 819.46 835.03 883.22 946.48 955.81 960.86 964.16 1036.63 1039.46 1076.76 1081.54 1081.95 1084.72 1101.82 1105.17 1110.75 1111.79 1133.24 1142.79 1159.62 1161.03 1181.62 1184.96 1200.41 1206.51 1218.17 1219.18 1223.42 1285.74 1312.66 1331.51 1357.30 1383.43 1387.18 1399.13 1426.09 1462.27 1498.36 1500.62 1523.42 1524.73 1526.11 1535.65 1536.79 1539.64 1544.69 1546.28 1550.28 1550.70 1563.71 1565.65 1568.47 1612.72 1699.86 1703.01 1740.32 1742.51 3094.80 3095.83 3099.85 3104.24 3194.68 3195.75 3202.50 3203.74 3240.90 3242.75 3256.83 3259.68 3307.04 3308.80 3315.64 3318.64 3321.52 3323.80 3330.52 3332.81
formula: C15H20N4
InChI: InChI=1S/C15H20N4/c1-16(2)15(17(3)4)18-11-7-5-9-13(18)14-10-6-8-12-19(14)15/h5-12H,1-4H3
39 atoms
C  -1.417748 0.929888 -1.98832
N  -1.862447 0.321598 -0.740552
C  -2.99468 -0.575766 -0.963242
C  -0.885794 -0.070349 0.174843
N  0.101845 1.087361 0.339017
C  -0.245094 2.281872 0.816155
C  0.734576 3.237277 0.989764
C  2.04929 2.938711 0.658983
C  2.376929 1.689109 0.146062
C  1.360922 0.777863 -0.00325
C  1.363941 -0.578037 -0.516606
C  2.371163 -1.33226 -1.065839
C  2.058427 -2.623909 -1.472756
C  0.770755 -3.116812 -1.310604
C  -0.200185 -2.31399 -0.748797
N  0.125316 -1.07552 -0.381007
N  -1.380735 -0.570834 1.380239
C  -2.431248 0.194544 2.049869
C  -0.419281 -1.091143 2.344889
H  -0.91802 0.217482 -2.653744
H  -2.298691 1.303984 -2.504874
H  -0.762149 1.78209 -1.827237
H  -3.858415 0.026306 -1.240906
H  -2.798894 -1.27975 -1.77776
H  -3.247072 -1.142739 -0.072777
H  -1.289884 2.458814 1.024206
H  0.458507 4.207671 1.374256
H  2.822398 3.682291 0.793134
H  3.390318 1.435547 -0.130822
H  3.367187 -0.926566 -1.172215
H  2.824551 -3.246536 -1.912985
H  0.511916 -4.121394 -1.609696
H  -1.211375 -2.649119 -0.568917
H  -2.011156 0.927479 2.745332
H  -3.069091 0.716811 1.343767
H  -3.047957 -0.496998 2.621516
H  0.204114 -0.305714 2.78593
H  0.223978 -1.857388 1.92011
H  -0.980868 -1.560085 3.149473
elementType: C N H
totalener: -800.58960271 hartree
nucrepener: 1571.08723836 hartree
electener: -2371.67684107 hartree
oneelecener: -4163.71008109 hartree
twoeener: 1792.03324001 hartree
cpcmener: -0.24836510 hartree
kineticenergy: 794.33344466 hartree
exchangeener: -61.870908901338 hartree
correlationener: -5.958823486327 hartree
xcener: -67.829732387665 hartree
chargesum: 2.0000000
charge: -0.559063 -0.418202 -0.577516 0.705820 -0.559937 0.077969 -0.329424 -0.075541 -0.357309 0.471737 0.471034 -0.356215 -0.075462 -0.328488 0.076411 -0.561091 -0.416798 -0.580917 -0.559587 0.248662 0.279590 0.268993 0.278917 0.254367 0.280395 0.372063 0.330106 0.332808 0.329159 0.328828 0.332726 0.330342 0.371824 0.254351 0.280806 0.281139 0.248570 0.268984 0.279950
charge: -0.263209 -0.173558 -0.263185 0.203984 0.050217 0.031505 -0.097869 -0.018558 -0.079417 0.072514 0.073036 -0.079134 -0.018361 -0.097719 0.031386 0.050043 -0.173897 -0.263575 -0.263268 0.130422 0.156445 0.142290 0.149929 0.132491 0.150869 0.197598 0.192373 0.189749 0.196997 0.196929 0.189717 0.192474 0.197717 0.132441 0.150830 0.150686 0.130419 0.142159 0.156527
qa: -0.5591 -0.4182 -0.5775 0.7058 -0.5599 0.0780 -0.3294 -0.0755 -0.3573 0.4717 0.4710 -0.3562 -0.0755 -0.3285 0.0764 -0.5611 -0.4168 -0.5809 -0.5596 0.2487 0.2796 0.2690 0.2789 0.2544 0.2804 0.3721 0.3301 0.3328 0.3292 0.3288 0.3327 0.3303 0.3718 0.2544 0.2808 0.2811 0.2486 0.2690 0.2800
va: 3.6203 3.0378 3.6225 3.7601 3.3529 3.6082 3.7786 3.6391 3.7117 3.4982 3.4969 3.7118 3.6389 3.7790 3.6102 3.3516 3.0360 3.6213 3.6207 0.8948 0.8947 0.8903 0.8901 0.8932 0.8932 0.8354 0.8724 0.8603 0.8755 0.8757 0.8603 0.8722 0.8353 0.8933 0.8929 0.8895 0.8950 0.8903 0.8944
dispcorr: -0.031821099 hartree
energy: -800.548486811031
dipole: -10.97885 12.56767 1.58882 -0.77854 0.90643 0.12789 2.14776 -2.47194 -0.32417
magnitude: 1.62659 au
magnitude: 4.13446 debye
temp: 298.15 k
press: 1.00 atm
zeropoint: 0.34662061 hartree
thermalvibcorrection: 0.01402054 hartree
thermalrotcorrection: 0.00141627 hartree
thermaltrasncorrection: 0.00141627 hartree
thermaltotal: -800.18501312 hartree
thermalcorr: 0.01685309 hartree
nonthermalcorr: 0.34662061 hartree
totalcorr: 0.36347370 hartree
thermalcorrenthalpy: 0.00094421 hartree
totalenthalpy: -800.18406891 hartree
totalentropycorr: -0.06005334 hartree
gibbsenthalpy: -800.24412225 hartree
gibbsminuselec: 0.30436456 hartree
