program: Orca
programVersion: 5.0.3
elementType: C N C C N C C C C C C C C C C N N C C H H H H H H H H H H H H H H H H H H H H
charge: 2
multiplicity: 1
keywords: SP DLPNO-CCSD(T) aug-cc-pVTZ aug-cc-pVTZ/C TightSCF CPCM(Acetonitrile)
formula: C15H20N4
InChI: InChI=1S/C15H20N4/c1-17(2)15(18(3)4)19-12-8-6-10-14(19)13-9-5-7-11-16-13/h5-12H,1-4H3
39 atoms
C  -1.61192 0.538085 -2.152333
N  -1.953655 -0.100772 -0.892599
C  -3.372749 -0.30425 -0.650284
C  -1.008322 -0.298769 0.039504
N  0.044978 1.237114 0.180042
C  -0.308675 2.459168 0.535798
C  0.667351 3.390484 0.859383
C  2.001097 3.015467 0.810871
C  2.347925 1.725413 0.427657
C  1.317727 0.863717 0.115784
C  1.393622 -0.514804 -0.34478
C  2.502121 -1.240782 -0.713275
C  2.322025 -2.51923 -1.222256
C  1.042068 -3.039669 -1.363459
C  -0.036385 -2.281755 -0.974172
N  0.166761 -1.059119 -0.464722
N  -1.348376 -0.638418 1.304815
C  -2.207527 0.27043 2.061411
C  -0.430066 -1.364765 2.173396
H  -2.18788 0.074502 -2.950549
H  -1.84628 1.603563 -2.124097
H  -0.55913 0.423352 -2.399483
H  -3.8926 0.627878 -0.426237
H  -3.804682 -0.729038 -1.554675
H  -3.530309 -1.011897 0.158401
H  -1.364033 2.695906 0.544882
H  0.376589 4.392067 1.140787
H  2.774862 3.725897 1.06643
H  3.381058 1.411624 0.379511
H  3.488615 -0.809056 -0.625838
H  3.181059 -3.103031 -1.522402
H  0.874143 -4.025544 -1.769975
H  -1.059508 -2.624392 -1.042298
H  -1.59915 0.889071 2.725609
H  -2.782611 0.926529 1.417566
H  -2.901433 -0.3119 2.664305
H  0.388218 -0.73283 2.531525
H  -0.026054 -2.25631 1.702782
H  -0.999045 -1.694096 3.039255
elementType: C N H
totalener: -797.41506961 hartree
nucrepener: 1554.82496235 hartree
electener: -2352.24003196 hartree
oneelecener: -4130.55731954 hartree
twoeener: 1778.31728758 hartree
cpcmener: -0.24946154 hartree
kineticenergy: 796.46874041 hartree
chargesum: 2.0000000
charge: -1.252567 -0.057526 -1.181459 2.330992 0.203596 -0.346414 -0.807924 -0.919598 -1.243613 1.130000 1.320690 -1.333591 -0.758622 -0.923016 0.144796 0.810576 -0.096805 -1.262444 -1.198023 0.223389 0.337356 0.421290 0.335430 0.221102 0.373379 0.527943 0.405903 0.751716 -0.012963 0.132827 0.754933 0.515779 0.331333 0.260648 0.465910 0.320265 0.437416 0.428799 0.208499
charge: 0.540304 0.289356 0.536459 -0.504077 0.386697 0.161983 0.289470 0.280696 0.310179 -0.190896 -0.128350 0.328090 0.311828 0.314872 0.232531 0.304611 0.297835 0.526861 0.538448 -0.142707 -0.131730 -0.152946 -0.137919 -0.143445 -0.158207 -0.131989 -0.155993 -0.141507 -0.145664 -0.141266 -0.126012 -0.147846 -0.096759 -0.129929 -0.186898 -0.128659 -0.128446 -0.158595 -0.140380
qa: -1.2526 -0.0575 -1.1815 2.3310 0.2036 -0.3464 -0.8079 -0.9196 -1.2436 1.1300 1.3207 -1.3336 -0.7586 -0.9230 0.1448 0.8106 -0.0968 -1.2624 -1.1980 0.2234 0.3374 0.4213 0.3354 0.2211 0.3734 0.5279 0.4059 0.7517 -0.0130 0.1328 0.7549 0.5158 0.3313 0.2606 0.4659 0.3203 0.4374 0.4288 0.2085
va: 3.5179 3.5043 3.7360 0.3789 1.2610 2.5847 2.3719 3.5891 2.7156 0.8958 2.1529 2.8197 3.4730 2.5340 2.8414 1.9393 2.5958 3.4991 3.5166 1.1621 1.0212 0.9369 1.0459 1.1786 1.0317 0.3905 1.1368 0.0657 1.3640 1.2929 -0.0093 0.9508 0.8307 1.1320 0.8767 1.0076 0.8656 0.9105 1.1215
e0: -797.415069750 hartree
corrType: DLPNO BASED
energy: -800.913152504259
dipole: -11.35783 12.09132 0.73349 -0.49817 -0.04192 -0.54009 2.77348 -3.07060 -0.29712
magnitude: 0.95811 au
magnitude: 2.43532 debye
