program: Orca
programVersion: 5.0.3
elementType: C C C C C N C N N H H H H H H H H H
charge: 0
multiplicity: 1
keywords: Freq RIJCOSX PBEh-3c CPCM(Acetonitrile)
frequency: 0.00 0.00 0.00 0.00 0.00 0.00 40.07 45.61 178.08 203.08 224.14 293.47 320.93 343.71 493.61 530.58 556.94 574.58 595.82 658.75 692.49 852.96 880.11 993.11 1002.17 1046.52 1062.64 1089.38 1093.43 1141.99 1146.03 1254.58 1345.28 1414.98 1446.96 1456.84 1510.41 1512.11 1513.52 1524.53 1536.41 1560.15 1679.23 1693.24 1696.47 3122.02 3122.68 3199.79 3201.26 3226.49 3228.10 3298.27 3679.66 3798.07
frequency: 40.07 45.61 178.08 203.08 224.14 293.47 320.93 343.71 493.61 530.58 556.94 574.58 595.82 658.75 692.49 852.96 880.11 993.11 1002.17 1046.52 1062.64 1089.38 1093.43 1141.99 1146.03 1254.58 1345.28 1414.98 1446.96 1456.84 1510.41 1512.11 1513.52 1524.53 1536.41 1560.15 1679.23 1693.24 1696.47 3122.02 3122.68 3199.79 3201.26 3226.49 3228.10 3298.27 3679.66 3798.07
formula: C6H9N3
InChI: InChI=1S/C6H9N3/c1-4-3-5(2)9-6(7)8-4/h3H,7H2,1-2H3
18 atoms
C  2.681028 -0.450534 0.15756
C  1.234715 -0.082253 0.068716
C  0.241498 -1.052563 0.008229
C  -1.074011 -0.613294 -0.078447
C  -2.215874 -1.575143 -0.15274
N  -1.372706 0.679786 -0.103475
C  -0.350458 1.536577 -0.045068
N  -0.648239 2.853395 -0.109136
N  0.941846 1.211993 0.042586
H  3.158764 0.064063 0.99135
H  2.815829 -1.522491 0.2861
H  3.205287 -0.147593 -0.750133
H  0.481753 -2.105843 0.033624
H  -2.947711 -1.363723 0.627282
H  -1.882734 -2.60555 -0.046623
H  -2.73081 -1.479733 -1.109891
H  -1.601749 3.135929 0.037577
H  0.063773 3.516776 0.142691
elementType: C N H
totalener: -397.50320990 hartree
nucrepener: 435.20263610 hartree
electener: -832.70584601 hartree
oneelecener: -1400.88492613 hartree
twoeener: 568.17908012 hartree
cpcmener: -0.01477269 hartree
kineticenergy: 394.53183937 hartree
exchangeener: -30.251476642696 hartree
correlationener: -2.888094814569 hartree
xcener: -33.139571457264 hartree
energy: -398.4033 -398.0350 -398.0340 -287.0005 -285.7438 -285.7430 -283.9495 -283.8315 -283.8305 -30.2135 -27.2774 -27.0420 -23.8768 -22.5646 -21.3880 -19.3824 -18.5757 -16.4533 -15.8686 -14.7609 -14.4544 -14.0239 -12.9741 -12.7424 -12.4310 -12.3827 -12.0755 -11.6418 -10.0682 -9.9142 -9.3404 -8.2561 -7.2954 -0.1113 0.9415 4.3347 4.6639 4.8659 4.9202 5.1423 5.5270 5.9932 6.2927 6.4900 6.5450 7.0482 7.2875 8.5920 8.6634 10.6602 10.8305 11.0568 11.8431 13.1995 13.3116 13.9260 14.3489 14.5212 14.9298 15.2364 15.9347 16.1554 17.0419 17.0455 17.5026 18.8515 18.8966 19.1273 19.4279 20.6214 20.9600 22.5977 23.4413 24.5431 24.6948 25.2582 26.2710 27.3685 27.5703 27.8261 28.0634 28.2075 28.2203 28.7533 28.9044 28.9737 29.4016 29.6155 29.7983 31.0398 32.3576 33.1091 35.2205 36.6961 37.5950 38.0898 38.1092 39.4665 39.5170 40.5717 41.9441 42.3180 45.3256 46.3225 47.5284 48.0661 49.2141 50.0085 50.8697 50.9107 52.0494 52.6367 53.6188 53.9770 55.0084 55.7162 58.8174 58.9399 60.6118 61.3121 61.8919 61.9739 63.5019 63.6935 64.3788 65.0779 65.5468 65.9285 66.7504 67.1739 67.8359 69.9877 70.9405 71.9554 72.2920 73.4671 76.4961 76.8116 77.1743 79.2749 82.8990 84.4611 90.0408 97.2810 366.1699 373.8579 377.3381 381.5188 383.4212 389.6125 523.5304 531.2698 531.5055 electronvolt
chargesum: 0.0000000
charge: -0.720080 0.289962 -0.420185 0.290719 -0.720632 -0.477595 0.514107 -0.822818 -0.476711 0.252978 0.245648 0.255841 0.255311 0.253520 0.245627 0.255580 0.389304 0.389425
charge: -0.361147 0.048646 -0.244970 0.048594 -0.361291 -0.229519 0.093547 -0.363591 -0.229050 0.152784 0.143432 0.155480 0.153592 0.153260 0.143298 0.155172 0.270844 0.270918
qa: -0.7201 0.2900 -0.4202 0.2907 -0.7206 -0.4776 0.5141 -0.8228 -0.4767 0.2530 0.2456 0.2558 0.2553 0.2535 0.2456 0.2556 0.3893 0.3894
va: 3.6872 3.7862 3.7604 3.7854 3.6872 3.0637 4.1022 2.8925 3.0648 0.9015 0.9057 0.8981 0.9074 0.9009 0.9057 0.8985 0.8349 0.8349
dispcorr: -0.009615539 hartree
energy: -397.487973500702
dipole: 1.09456 -1.05682 0.03773 -4.87315 4.63430 -0.23885 0.38130 -0.07350 0.30780
magnitude: 0.39142 au
magnitude: 0.99492 debye
temp: 298.15 k
press: 1.00 atm
zeropoint: 0.15282238 hartree
thermalvibcorrection: 0.00619172 hartree
thermalrotcorrection: 0.00141627 hartree
thermaltrasncorrection: 0.00141627 hartree
thermaltotal: -397.32612686 hartree
thermalcorr: 0.00902427 hartree
nonthermalcorr: 0.15282238 hartree
totalcorr: 0.16184664 hartree
thermalcorrenthalpy: 0.00094421 hartree
totalenthalpy: -397.32518265 hartree
totalentropycorr: -0.04351214 hartree
gibbsenthalpy: -397.36869479 hartree
gibbsminuselec: 0.11927871 hartree
