program: Orca
programVersion: 5.0.3
elementType: C C C N C C C C C H H H H H H H H H H H H H H H H H H H
charge: 0
multiplicity: 1
keywords: SP DLPNO-CCSD(T) aug-cc-pVTZ aug-cc-pVTZ/C TightSCF CPCM(Acetonitrile)
formula: C8H19N
InChI: InChI=1S/C8H19N/c1-6-9(7(2)3)8(4)5/h7-8H,6H2,1-5H3
28 atoms
C  1.948892 -0.752441 -0.97656
C  1.368724 -0.05331 0.256906
C  1.727067 -0.821026 1.5265
N  -0.05683 0.247193 0.197655
C  -0.959074 -0.885313 0.007033
C  -2.21983 -0.699255 0.848475
C  -1.339005 -1.205751 -1.443775
C  -0.378701 1.440835 -0.562019
C  -0.075442 2.726684 0.196481
H  1.57902 -1.775568 -1.072646
H  1.705901 -0.218085 -1.896502
H  3.036746 -0.804601 -0.904972
H  1.871191 0.915254 0.334762
H  1.316832 -1.83267 1.526163
H  2.810008 -0.913816 1.620884
H  1.353603 -0.304124 2.411068
H  -0.442857 -1.76553 0.39867
H  -1.968288 -0.573126 1.901874
H  -2.783113 0.180217 0.528347
H  -2.882924 -1.5612 0.757411
H  -1.962736 -0.425559 -1.884657
H  -0.46474 -1.334611 -2.080063
H  -1.913696 -2.133037 -1.478868
H  0.126036 1.465888 -1.539899
H  -1.447006 1.434201 -0.785128
H  0.983382 2.829201 0.437771
H  -0.637483 2.76016 1.130538
H  -0.355644 3.595924 -0.40026
elementType: C N H
totalener: -368.57010467 hartree
nucrepener: 520.00528264 hartree
electener: -888.57538730 hartree
oneelecener: -1529.56354016 hartree
twoeener: 640.98815285 hartree
cpcmener: -0.00417811 hartree
kineticenergy: 368.23406351 hartree
chargesum: 0.0000000
charge: -0.989599 0.286409 -1.326445 0.225358 0.720639 -1.460551 -1.162098 -0.534078 -1.059631 0.221423 0.227239 0.291210 0.590807 0.253949 0.199621 0.243787 0.530695 0.221322 0.277894 0.216029 0.224157 0.326047 0.176604 0.247724 0.297162 0.271106 0.241214 0.242003
charge: 0.597898 -0.155433 0.598224 0.314753 -0.156716 0.595614 0.602497 0.135725 0.599795 -0.166669 -0.167291 -0.160312 -0.159922 -0.172190 -0.162542 -0.159231 -0.163166 -0.163017 -0.167211 -0.164151 -0.167205 -0.181371 -0.159254 -0.132182 -0.172126 -0.179972 -0.165896 -0.168650
qa: -0.9896 0.2864 -1.3264 0.2254 0.7206 -1.4606 -1.1621 -0.5341 -1.0596 0.2214 0.2272 0.2912 0.5908 0.2539 0.1996 0.2438 0.5307 0.2213 0.2779 0.2160 0.2242 0.3260 0.1766 0.2477 0.2972 0.2711 0.2412 0.2420
va: 3.8395 2.6033 3.8977 1.7704 2.1867 3.7459 3.7485 3.5750 3.7886 1.0695 1.1557 0.9676 0.4271 1.0777 1.1152 1.1062 0.4626 1.1473 1.0407 1.1271 1.1225 1.0341 1.1207 1.1056 0.9707 1.0735 1.1010 1.0702
e0: -368.570105173 hartree
corrType: DLPNO BASED
energy: -370.392591907302
dipole: -0.07140 0.19116 0.11977 -0.43121 0.30390 -0.12731 -0.93286 0.56069 -0.37217
magnitude: 0.41117 au
magnitude: 1.04512 debye
