program: Gaussian 16
title: sq prod BrF isomer.
version: ES64L-G16RevC.01
frameworkgroup: C1[X(C36H16Br8CoF8Na2)]
method: UwB97XD
basis: Gen
operation: Freq
keyword: #P
keyword: Geom=AllCheck
keyword: Guess=TCheck
keyword: SCRF=Check
keyword: GenChk
keyword: UwB97XD/ChkBas
keyword: Freq
converged: YES YES NO YES
polarizability: 5.74370915e+02 4.46985421e+00 5.30560423e+02 -4.21725559e+00 -1.87270493e+00 5.07591991e+02
1716.lowfreq: -9.3806 -0.0004 -0.0003 0.0006 1.5419 6.4296 14.1205 17.5690 18.4736
frequency: 13.9116 17.2533 18.4046 21.8471 24.5500 25.5753 27.0376 31.4117 32.3698 35.9830 38.0812 39.0481 40.1298 42.5801 45.0857 49.0441 54.1218 56.7505 60.3099 62.6963 64.4107 67.3723 71.5587 76.1724 79.0538 80.4058 84.8609 89.2013 96.3586 98.2627 105.5567 113.7554 122.2742 139.9632 150.2232 162.8422 172.3515 177.2339 179.0033 184.9676 186.5536 187.1894 188.2180 195.2532 197.2431 202.9607 211.6451 213.3839 215.4831 216.3935 217.1610 220.8772 225.2885 233.8327 236.1379 239.0312 251.6322 263.8119 267.9612 289.8617 298.4379 301.2992 304.4161 305.8740 309.7879 328.2786 331.8247 410.9198 412.3050 413.9710 414.9429 423.3824 423.4514 425.1030 426.4936 473.0291 473.2935 473.6225 474.8601 498.6906 499.7994 500.5704 502.3667 533.7423 549.4635 553.1192 558.9087 601.4972 602.4346 604.9110 609.1842 624.9751 625.1337 625.7352 626.6614 649.9419 650.1457 650.3124 650.8095 717.2221 718.7205 724.9588 729.3603 729.8391 732.3733 733.0937 735.6490 738.7605 743.4544 744.2004 747.2163 786.3510 788.0588 788.3674 796.6124 870.0765 870.4442 870.5046 870.8591 894.4994 895.1174 896.8427 898.1379 942.6311 943.5438 944.7538 947.8758 1015.1965 1015.2589 1015.8071 1018.1046 1027.9426 1028.0183 1029.1062 1029.9753 1040.7183 1042.2029 1074.6992 1074.9842 1075.8365 1076.6183 1087.4129 1088.5832 1091.5846 1095.2098 1187.8938 1189.1666 1197.1649 1198.0790 1200.0201 1203.6598 1212.2127 1213.1204 1214.1286 1215.8441 1265.9213 1268.1679 1275.4630 1276.0804 1323.7548 1324.3427 1326.2963 1328.7923 1353.4662 1354.4065 1387.0738 1388.5354 1404.3220 1404.4793 1405.6418 1406.1422 1440.1512 1441.8687 1443.2434 1448.3520 1529.0582 1529.7100 1530.9079 1531.1173 1633.9217 1634.0452 1635.0075 1635.7606 1652.9310 1653.5686 1653.8351 1655.4935 1671.8706 1672.5499 1672.5841 1673.0067 3217.6152 3218.8417 3225.7177 3227.9624 3228.1340 3229.3662 3239.5753 3240.6615 3241.3350 3241.4564 3249.6468 3250.7549 3267.7174 3268.5685 3268.5816 3268.6618
redmass: 10.5253 15.2802 14.4675 10.8218 6.7928 8.0557 13.9409 6.0084 12.1740 10.6177 10.6539 9.5635 18.8128 11.6904 8.8207 13.4295 14.1860 12.3283 9.7863 18.9146 25.2779 16.3818 20.1615 8.4586 6.1763 7.8323 6.0339 16.1196 14.8950 4.5948 10.5468 10.1294 15.4768 16.8515 18.0687 19.8695 16.0404 14.7716 15.2277 14.7468 11.8778 11.4205 13.0034 15.3110 14.9261 16.6651 19.7976 32.7283 37.4351 44.6005 40.8213 21.0243 20.1660 18.9476 18.0384 17.4469 16.1745 12.6438 13.0955 10.9637 21.5043 7.8567 21.9558 19.8221 20.8961 12.5299 12.4124 11.1238 11.4537 11.3243 11.1013 2.8505 2.8353 2.8506 2.8698 15.0175 15.0597 15.0881 15.0805 10.7996 10.8056 10.9357 10.6534 4.9651 5.1466 5.1788 5.0027 7.4773 7.4691 7.5155 7.5962 6.0563 6.0771 6.0696 6.0836 9.2767 9.0415 9.1083 9.0538 1.1033 1.0968 6.2691 3.6125 3.4527 6.7084 6.7580 7.1149 9.9379 10.1114 10.1997 9.9873 10.5199 10.5586 10.7274 10.4536 1.4793 1.4781 1.4790 1.4733 1.2548 1.2532 1.2516 1.2527 12.2921 12.2254 12.1986 12.2088 1.3873 1.3812 1.3873 1.3837 5.9625 5.9187 6.0601 6.1938 1.2614 1.2657 1.6776 1.6809 1.6749 1.6831 5.2186 5.1611 5.1458 4.8643 1.1152 1.1206 1.6966 1.7020 1.6775 1.6657 1.1305 1.1313 1.1307 1.1317 9.5256 10.2745 10.4471 10.3411 9.3314 9.4362 9.6935 9.5582 5.4668 5.5990 1.2470 1.2465 8.9217 8.9771 8.8061 8.9913 5.9176 5.9808 5.8719 5.9825 2.0501 2.0456 2.0460 2.0332 7.9293 7.9392 8.0146 7.9520 10.3306 10.3626 10.2707 10.4221 5.4181 5.4271 5.4346 5.4674 1.0862 1.0861 1.0895 1.0894 1.0892 1.0897 1.0957 1.0960 1.0960 1.0965 1.1003 1.0993 1.0940 1.0940 1.0940 1.0940
irintensity: 0.1925 0.1724 0.0719 0.2547 0.2733 0.0933 0.3602 0.1845 0.0953 0.5648 0.1821 0.0752 0.0905 0.0775 0.3851 0.8677 1.4750 6.0381 1.7221 0.3319 0.8262 0.3959 1.8935 1.6397 2.0764 0.4039 2.1279 0.2228 0.2702 2.3298 0.6825 0.4243 0.5137 3.3266 2.2297 2.3907 5.0616 6.8798 9.8148 6.6398 3.0354 1.6573 4.6212 1.7322 24.5896 5.8490 15.7590 1.9940 1.2895 0.3459 1.8336 3.4007 12.2346 1.2890 5.5517 1.0476 2.1204 6.9859 10.5069 0.4298 4.5260 0.1025 0.4400 1.8311 2.0593 5.3675 3.5886 0.0832 0.1989 0.0307 0.0111 0.0094 0.0927 0.0509 0.0124 0.0390 0.1590 0.4556 0.2417 17.4455 14.1902 1.0335 31.5341 1.4052 3.3369 4.9810 0.7163 1.7486 1.6510 1.1470 2.0576 0.0504 0.0170 0.2073 0.0201 2.0073 3.5029 2.6591 2.6353 362.0482 61.4051 2.0820 0.0252 2.6964 1.9630 2.7323 0.1523 1.3988 1.6669 0.8213 2.8223 66.1254 41.7102 12.8517 286.2626 21.1943 12.6467 30.7947 15.2514 0.3110 0.2347 0.5211 0.0987 1.7252 1.2221 0.8447 6.2499 0.1785 0.0481 0.1639 0.1490 1.2929 0.9666 0.0634 0.0039 0.0986 0.1717 5.3510 4.2738 3.9643 4.6694 27.7807 82.5691 103.3773 34.8864 0.2522 0.2573 30.2759 32.0259 78.9017 87.3695 0.9011 0.4737 0.6984 0.4779 27.8362 29.8443 0.5222 0.7456 29.5554 26.9447 35.9731 7.6566 0.1245 0.1449 0.0265 0.0214 28.6094 27.0945 0.8645 3.8339 132.0044 123.2491 77.2307 517.3504 10.1952 10.3166 11.4831 10.4682 12.0867 69.7293 26.8276 58.6427 3.5564 11.6313 29.8760 4.6459 0.0056 0.0295 0.0215 0.1528 0.0321 0.1090 0.2185 0.3680 0.2827 1.0481 5.6254 6.3804 5.6086 5.3470 0.4338 0.6637 3.2521 2.8051 3.7289 3.0954
temp: 298.150 k
press: 1.00000 atm
elementType: 27 11 11 9 6 6 6 6 6 6 6 6 6 6 6 6 9 6 6 6 6 6 6 6 6 6 6 6 6 9 9 9 6 6 6 6 6 6 1 1 1 1 1 1 6 6 6 6 6 6 1 1 1 1 1 1 9 35 35 35 35 35 35 1 1 1 1 35 35 9 9
symmnumber: 1
zpe: 1109716.9 jmol-1
zpe.correction: 0.422669 hartree
zpe.thermalcorrener: 0.480130 hartree
zpe.thermalcorrenthalpy: 0.481074 hartree
zpe.thermalcorrgfe: 0.317731 hartree
zpe.sumelectzpe: -2754.294585 hartree
zpe.sumelectthermal: -2754.237124 hartree
zpe.sumelectthermalent: -2754.236180 hartree
zpe.sumelectthermalfe: -2754.399522 hartree
dipole: 0.3074 0.5204 0.3324
dipole: 0.6898
quadrupole: -337.4432 -397.3949 -399.6986
quadrupole: -9.5276 16.6859 -4.4727
quadrupole: 40.7357 -19.2160 -21.5197 -9.5276 16.6859 -4.4727
hfenergy: -2754.7172535 hartree
pointgroup: C01 [X(C36H16Br8Co1F8Na2)]
dipole: -0.1168772 -0.1776168 0.1686471 debye
polarizability: 561.3510517|18.287402|536.4539211|17.7008394|-0.3058173|514.7183564 unknown
InChI: InChI=1S/4C6HBr2F2.2C6H6.Co.2Na/c4*7-3-1-5(9)4(8)2-6(3)10;2*1-2-4-6-5-3-1;;;/h4*1H;2*1-6H;;;
charge 0 multiplicity 2
71 atoms
Co -0.09765506 0.05570594 -0.09883268
Na 3.07822496 -0.00185822 0.01924485
Na -3.31318255 -0.03247256 -0.11117756
F  2.09851436 0.57145277 1.97322163
C  0.00449551 1.48093119 1.32032824
C  -0.20984185 -1.39895207 -1.49047352
C  -1.60351724 -3.24935569 -2.37126319
C  -1.33277223 -2.21701259 -1.48935003
C  -0.6746768 -3.54780821 -3.35977065
C  1.11028088 1.51438136 2.16253714
C  1.34276994 2.42805874 3.17716363
C  0.39990467 3.41895242 3.42114912
C  -0.90130992 2.50605306 1.59439668
C  -0.72078159 3.43898463 2.61361976
C  0.47229904 -2.77879695 -3.40335761
C  0.69215861 -1.73909618 -2.50091315
F  2.16265283 1.97931787 -0.60870236
C  0.03375762 1.46326041 -1.52736358
C  -0.03376975 -1.36130366 1.33616333
C  -0.69907402 -2.66101776 3.30953282
C  -0.91398258 -1.64453983 2.37991492
C  0.43295782 -3.45180523 3.26875848
C  1.18636468 2.24152752 -1.54877894
C  1.48849829 3.24145294 -2.45719301
C  0.57349253 3.53811167 -3.45964136
C  -0.84142566 1.78749563 -2.56444761
C  -0.58922613 2.79342921 -3.49571549
C  1.35358378 -3.19506663 2.25984572
C  1.08305727 -2.18856525 1.34838159
F  -1.48131761 3.06352153 -4.46666444
F  -1.6411288 4.39585827 2.83419813
F  1.38131923 -3.06073547 -4.35429017
C  5.80641223 -0.95735918 -0.31047657
C  5.58294905 -1.00439765 1.06778574
C  5.35492299 0.17636389 1.77749985
C  5.34786876 1.40320527 1.11050902
C  5.57108888 1.45074945 -0.26695593
C  5.80102351 0.27001964 -0.97730067
H  5.97223495 -1.87528852 -0.86468501
H  5.56666041 -1.9591322 1.58289201
H  5.15569995 0.14187733 2.84330629
H  5.14476895 2.31517361 1.66208891
H  5.54333539 2.40151887 -0.78854933
H  5.96759415 0.30578868 -2.04917843
C  -5.66131246 -1.1162174 -1.48209796
C  -5.642107 -1.7660744 -0.24631533
C  -5.85305692 -1.04077397 0.92756559
C  -6.07558963 0.33698954 0.86688129
C  -6.09424121 0.98724792 -0.36859364
C  -5.89197254 0.25958458 -1.5435923
H  -5.48354825 -1.68255244 -2.39064032
H  -5.44195847 -2.83107841 -0.20013262
H  -5.82854142 -1.54529078 1.88764217
H  -6.2300961 0.90308542 1.77972235
H  -6.26547092 2.05776211 -0.41600657
H  -5.90546637 0.76653877 -2.5030022
F  -2.30688713 -1.97231021 -0.54073268
Br -2.50622116 2.73895965 0.55412764
Br 2.92822923 2.35306022 4.22591358
Br -2.50198325 0.84506215 -2.83041596
Br 3.13302127 4.19149554 -2.36385801
Br 2.34956064 -0.78959629 -2.76346836
Br -3.21815814 -4.24924951 -2.25874623
H  0.5852783 -4.22900184 4.00604602
H  -0.82676443 -4.34527011 -4.07509064
H  0.75192612 4.31118764 -4.19535985
H  0.52512939 4.15618416 4.20318453
Br -2.51017779 -0.60501921 2.6635355
Br 2.9605361 -4.20706443 2.15882419
F  -1.59549535 -2.89193886 4.28681697
F  2.04838348 -1.97660902 0.38523478
