program: Gaussian 09
title: 000043588
version: EM64L-G09RevD.01
frameworkgroup: C1[X(C17H25N7O5)]
method: RPBEPBE
basis: SDD
operation: Freq
keyword: #p
keyword: freq=noraman
keyword: PBEPBE/SDD
title: #p freq=noraman PBEPBE/SDD
converged: YES YES NO NO
title: Mulliken charges:
elementType: O O O O O N N N N N N N C C C C C C C C C C C C C C C C C H H H H H H H H H H H H H H H H H H H H H H H H H
charge: -0.403938 -0.322568 -0.254193 -0.414413 -0.268561 -0.378406 -0.162355 -0.547280 -0.419673 -0.421452 -0.077606 -0.082589 -0.061611 -0.199293 -0.117654 -0.707747 -0.614044 0.252437 -0.257618 0.219255 -0.667343 -0.521862 0.246144 0.412671 0.413828 -0.480641 -0.484666 -0.242416 -0.246025 0.258419 0.289944 0.287083 0.260157 0.221280 0.227000 0.223307 0.233556 0.244853 0.260731 0.229901 0.268526 0.262110 0.227560 0.250016 0.286119 0.272276 0.354866 0.259379 0.383735 0.348565 0.261423 0.390354 0.256452 0.252002
chargesum: 0.00000
title: Mulliken charges with hydrogens summed into heavy atoms:
elementType: O O O O O N N N N N N N C C C C C C C C C C C C C C C C C
charge: -0.020203 -0.322568 -0.254193 -0.024058 -0.268561 -0.091323 -0.162355 0.011114 -0.064806 -0.072887 -0.077606 -0.082589 0.196808 0.090652 0.142503 -0.036160 -0.135635 0.252437 0.003113 0.219255 0.093194 -0.044285 0.246144 0.412671 0.413828 -0.221262 -0.223242 0.014036 0.005978
polarizability: 2.98087270e+02 1.03637923e+01 2.42505306e+02 4.09934347e+00 -5.13712371e+00 1.87536074e+02
1716.lowfreq: -5.9976 -3.7784 -0.0009 -0.0008 -0.0002 4.0307 8.9404 14.9641 20.7032
frequency: 3.1907 14.3840 20.5464 26.6098 35.5244 43.6896 49.5826 59.1145 71.4373 75.0922 83.1571 99.5751 104.2388 111.0691 129.4964 136.5349 146.4136 157.5486 169.2460 176.9105 199.5897 203.8681 219.2781 233.1662 238.4964 254.7050 284.9139 297.1497 304.3022 317.9317 323.0023 335.9991 344.5995 360.5708 381.5133 399.0199 417.1169 466.8478 474.9242 515.4617 545.2397 575.0108 585.8109 594.1638 612.9242 621.7109 641.9665 647.5446 652.2151 657.9366 660.6245 694.3463 709.1269 715.5601 741.8374 747.7039 758.2708 777.2637 780.7378 781.1192 784.2274 788.3253 824.5219 827.0119 846.1885 891.9453 897.5949 899.6079 928.5063 942.2226 952.3307 954.0124 983.2751 996.0964 1005.4973 1033.4115 1054.3990 1069.4856 1079.6286 1087.2833 1091.7839 1094.1923 1096.7842 1110.6131 1112.6024 1117.5205 1121.6238 1128.4686 1145.4893 1159.9053 1182.1321 1191.0943 1208.4633 1230.6535 1235.3905 1237.9181 1238.5821 1247.4041 1262.9900 1267.1236 1277.6341 1310.2336 1314.0337 1319.0040 1326.0201 1336.5901 1348.5248 1356.9888 1360.7523 1363.0867 1368.2752 1373.3338 1377.7391 1385.7093 1386.5387 1431.0955 1433.0783 1446.5436 1452.0112 1454.6689 1461.4844 1463.9095 1476.7203 1481.6339 1499.2271 1547.4974 1559.9117 1565.6228 1637.7852 1647.0138 1649.4497 2961.2319 2977.7523 2987.2898 2988.4159 3001.2715 3032.2570 3049.3866 3054.1907 3064.9685 3072.0921 3076.8581 3079.9055 3087.5195 3115.5423 3219.1868 3220.9499 3239.2323 3240.4940 3444.4111 3482.3696 3495.9433 3513.3124 3516.9172 3521.5135 3575.3294
redmass: 7.2195 6.9977 6.3967 4.7648 6.2856 5.3874 6.8797 4.6170 4.5882 4.8387 3.6435 5.3811 5.7452 6.2891 4.5637 5.5496 4.5242 3.0523 4.7032 1.2035 1.1369 4.9560 4.0462 3.9124 2.9946 3.2130 1.8016 2.1627 5.8055 2.3064 2.7636 3.3252 4.9672 3.4974 2.6972 3.3735 3.2442 3.3070 3.3836 2.5153 3.7565 2.5602 1.8747 2.6842 2.5011 1.4394 3.6443 2.8731 2.8069 3.4229 3.0841 3.8295 4.8034 3.5571 3.2734 1.8326 2.1949 1.8853 1.4124 2.7419 2.1547 1.2640 1.4802 1.4444 2.7814 2.6707 5.7055 4.5706 1.7501 3.3699 2.3868 2.2229 3.1878 3.5262 2.8944 3.3516 2.1085 3.3790 2.0601 2.2182 2.1423 2.2618 2.2565 1.8461 1.3647 1.8463 2.5491 1.4690 2.4135 2.8576 1.6007 1.8623 2.1458 2.4450 1.7779 1.5943 1.5557 1.4554 1.5187 1.6049 1.4826 1.4701 1.5253 1.3344 1.6183 1.5026 2.2384 2.1493 1.6994 1.9565 2.8253 2.2994 1.5710 1.9476 1.2683 3.0545 2.9318 1.1361 1.1629 1.1734 1.1265 1.0616 1.0899 1.0659 1.0708 6.5384 4.7501 4.7684 1.0949 7.8697 7.8997 1.0832 1.0357 1.0360 1.0613 1.0642 1.0851 1.0851 1.1000 1.0860 1.1028 1.0990 1.0994 1.0975 1.0983 1.0980 1.0978 1.0993 1.0994 1.0447 1.0754 1.0638 1.0763 1.0709 1.0833 1.0980
irintensity: 1.8741 1.8777 1.6575 0.0483 0.9047 2.6901 2.9717 3.2141 2.2575 6.2804 2.6233 3.0736 1.4979 9.0573 2.3427 7.7148 2.6332 0.8429 3.4697 0.1005 0.4062 5.4147 10.3282 5.3275 6.1105 3.7522 57.4859 8.0882 6.0905 1.9508 1.3747 12.0211 6.0515 5.1075 10.1477 1.8228 59.8646 14.2040 27.5885 45.3499 15.5805 53.6851 162.6858 62.7342 50.5847 229.7840 13.6161 52.9909 103.6176 5.0723 52.2745 33.3112 66.3176 45.8878 1.9163 72.3353 71.1735 68.4709 17.0537 29.3085 83.2884 9.6197 42.2093 45.4661 6.6470 20.7739 9.5387 7.0453 6.1581 6.0115 23.2470 21.9766 13.3120 11.9523 39.5246 74.5505 124.3378 15.0358 199.1690 35.4899 52.1865 8.8283 43.8269 15.7793 1.0749 20.0207 20.8444 1.3401 20.1053 91.2705 7.5384 8.5730 8.3542 17.6793 9.2463 2.8111 15.4849 3.3736 73.9589 4.2190 35.3860 9.3692 5.7801 24.0594 41.9305 9.8138 16.0288 37.9195 4.4488 36.7559 22.2187 23.9381 20.8964 13.2419 12.3518 16.8545 16.2478 9.6923 25.4553 10.0185 9.4608 13.8274 6.6100 33.6540 32.4918 170.8946 29.2282 67.2955 37.9684 230.3736 162.7127 19.0635 17.3963 30.1432 30.5677 18.5548 2.7382 21.9961 11.0586 11.4770 19.1076 45.7515 21.8865 15.1309 3.7364 6.5649 6.2471 1.9093 1.6778 4.0817 3.5792 27.9821 150.2998 17.9770 95.0419 3.3776
temp: 298.150 k
press: 1.00000 atm
elementType: 8 8 8 8 8 7 7 7 7 7 7 7 6 6 6 6 6 6 6 6 6 6 6 6 6 6 6 6 6 1 1 1 1 1 1 1 1 1 1 1 1 1 1 1 1 1 1 1 1 1 1 1 1 1
symmnumber: 1
zpe: 1127741.7 jmol-1
zpe.correction: 0.429534 hartree
zpe.thermalcorrener: 0.459767 hartree
zpe.thermalcorrenthalpy: 0.460711 hartree
zpe.thermalcorrgfe: 0.362589 hartree
zpe.sumelectzpe: -1419.995119 hartree
zpe.sumelectthermal: -1419.964886 hartree
zpe.sumelectthermalent: -1419.963942 hartree
zpe.sumelectthermalfe: -1420.062064 hartree
dipole: 0.6683 2.4841 1.3301
dipole: 2.8959
quadrupole: -249.6198 -170.7261 -163.8182
quadrupole: 30.4743 0.3411 4.4781
quadrupole: -54.8985 23.9953 30.9032 30.4743 0.3411 4.4781
hfenergy: -1420.4246533 hartree
pointgroup: C01 [X(C17H25N7O5)]
dipole: -0.1771587 1.0717203 -0.3437374 debye
polarizability: 295.9403258|-15.4214412|240.6599322|6.8315219|13.8896247|191.5283927 unknown
InChI: InChI=1S/C17H25N7O5/c1-9(23-13(16(26)27)4-11-6-20-8-22-11)14(17(28)29)24(2)15(25)12(18)3-10-5-19-7-21-10/h5-9,12-14,21-23,26,28H,3-4,18H2,1-2H3
charge 0 multiplicity 1
54 atoms
O  -1.041487 -2.152109 0.523603
O  -2.710427 1.18686 1.602175
O  -0.113748 -1.609628 -1.531725
O  2.680697 -0.570617 -2.108848
O  3.664755 -2.186978 -0.768778
N  1.760909 0.089189 0.615394
N  -1.762508 0.885742 -0.508141
N  -4.006035 3.487374 0.064625
N  6.175477 -1.352755 0.348976
N  -4.649227 -0.993692 0.9165
N  7.852031 0.087726 0.825684
N  -5.814649 -2.280578 -0.531525
C  0.759313 0.908202 -0.099898
C  -0.604579 0.193762 0.115414
C  3.168197 0.085661 0.155942
C  0.713945 2.384205 0.358183
C  4.110672 -0.217857 1.3499
C  -2.776459 1.332674 0.330433
C  -4.007133 2.051643 -0.279265
C  -0.524351 -1.248408 -0.404779
C  -1.810893 1.004518 -1.985369
C  -5.30343 1.392649 0.283855
C  3.239186 -1.016254 -0.916661
C  5.576834 -0.274598 1.020795
C  -5.373386 -0.099833 0.108157
C  6.635257 0.597422 1.307811
C  -6.08636 -0.922251 -0.774425
C  7.534933 -1.091407 0.250389
C  -4.939636 -2.28449 0.49588
H  1.024814 0.856125 -1.171328
H  -0.831144 0.160582 1.195856
H  1.659508 0.088361 1.636359
H  3.462176 1.049292 -0.310999
H  0.008527 2.975875 -0.253067
H  1.713702 2.845239 0.260248
H  0.394523 2.462482 1.414052
H  3.961309 0.581143 2.099433
H  3.778105 -1.16999 1.809237
H  -4.019681 1.963806 -1.377239
H  -1.875852 2.060162 -2.304692
H  -0.892362 0.568131 -2.405833
H  -2.663271 0.44376 -2.407312
H  -5.366574 1.653621 1.358022
H  -6.157603 1.870524 -0.223834
H  -3.929888 3.650598 1.075453
H  -3.347793 4.061354 -0.471907
H  5.646812 -2.144306 -0.029298
H  6.597034 1.548489 1.835851
H  -1.013548 -3.072646 0.141784
H  -3.985821 -0.702617 1.639851
H  -6.783276 -0.621887 -1.554504
H  2.523649 -1.334395 -2.727989
H  8.23916 -1.764167 -0.232893
H  -4.5151 -3.17201 0.958445
