program: Gaussian 09
title: 000043414
version: EM64L-G09RevD.01
frameworkgroup: C1[X(C12H12O6)]
method: RPBEPBE
basis: SDD
operation: Freq
keyword: #pfreq=noraman
keyword: PBEPBE/SDD
title: #p freq=noraman PBEPBE/SDD
converged: YES YES NO NO
title: Mulliken charges:
elementType: O O O O O O C C C C C C C C C C C C H H H H H H H H H H H H
charge: -0.250497 -0.167712 -0.256702 -0.431124 -0.192181 -0.173605 -0.283506 -0.138834 -0.100243 -0.541741 0.166771 -0.151245 -0.412170 0.253929 -0.296194 0.221058 -0.332961 -0.011179 0.263052 0.250132 0.258461 0.278144 0.258164 0.242712 0.242635 0.251162 0.356404 0.255923 0.262129 0.179217
chargesum: 0.00000
title: Mulliken charges with hydrogens summed into heavy atoms:
elementType: O O O O O O C C C C C C C C C C C C
charge: -0.250497 -0.167712 -0.256702 -0.074720 -0.192181 -0.173605 -0.020454 0.111298 0.158218 -0.005433 0.166771 0.091467 -0.169534 0.253929 -0.045032 0.221058 0.185090 0.168039
polarizability: 1.80441489e+02 -9.00740809e+00 1.35536291e+02 8.48745715e+00 5.15954852e+00 1.10515833e+02
1716.lowfreq: -10.0224 -7.1708 -0.0005 0.0005 0.0006 6.0066 9.8676 35.1977 39.2599
frequency: 9.2360 35.1223 39.2195 63.4584 67.7716 93.8663 136.4276 145.0965 173.9447 207.8181 239.0867 259.0806 278.9870 302.9152 339.1878 352.3528 373.7169 426.5028 436.3114 439.5409 485.7291 504.7663 530.3555 584.5170 605.0799 632.9378 676.4412 687.0135 701.4667 725.7717 738.6113 764.6420 780.3447 825.6846 835.7203 850.3387 900.2557 919.0422 954.3150 969.0833 980.5892 990.3154 999.2171 1021.4575 1029.5752 1065.4358 1100.5119 1115.2119 1129.9946 1142.0436 1163.0654 1191.7004 1203.3844 1223.3012 1224.8354 1256.2253 1265.1006 1305.8212 1306.5692 1314.5403 1319.8680 1335.9139 1352.0509 1366.7100 1409.6497 1424.5260 1425.4243 1619.9040 1626.8196 1654.4829 1659.6479 1682.3029 2888.1974 2973.6983 2990.4051 2992.3086 2993.4469 3003.0737 3079.4100 3095.7089 3125.3477 3152.6746 3179.0687 3572.9367
redmass: 8.0042 6.2923 7.1199 8.5832 7.4952 3.9615 5.2805 3.2000 3.5272 4.9111 6.3287 5.9565 4.3773 6.0137 5.1940 3.2777 3.9903 4.2540 4.8639 1.2363 3.7627 5.4549 3.1375 4.5624 4.1207 3.1842 2.8305 4.5099 4.9254 3.6384 1.5991 2.4432 1.8747 3.8533 3.6851 3.1994 4.6974 2.6756 2.8669 1.4140 3.4330 4.8841 2.2000 5.3154 3.6159 2.2511 3.6290 1.7901 2.0722 1.6215 1.1020 2.3042 1.6672 1.3500 1.1383 1.3997 1.5439 1.1973 1.2707 1.3799 1.3996 1.5647 1.5823 1.2163 1.1045 1.0875 2.2788 8.9139 10.2835 8.4560 6.8864 10.3396 1.0857 1.0811 1.0787 1.0850 1.0625 1.0678 1.0987 1.0987 1.0919 1.0860 1.1007 1.0657
irintensity: 1.1422 3.3555 0.9616 1.7679 1.3307 1.5176 5.7554 15.7939 4.5894 0.0690 4.2091 7.5574 5.3311 6.0925 18.5594 17.6110 5.3137 2.1321 19.2040 122.4659 10.3698 2.6422 2.8438 12.9638 14.0200 4.9915 11.0498 5.5919 3.3442 20.4391 6.6685 20.7383 71.4578 10.8590 17.8653 8.3879 17.1623 17.4754 12.8582 0.3733 54.4296 3.4465 16.1902 91.1194 27.0747 14.6693 371.0568 202.5005 33.6026 15.0431 23.2281 22.0781 53.1719 15.4875 1.5044 5.4895 66.6836 10.0699 17.1740 9.9482 8.8816 13.8659 9.8224 6.2894 45.9053 17.6006 17.1534 93.6086 110.0982 96.0044 97.3049 141.7343 143.0001 11.5575 16.0289 18.5727 29.5075 10.4091 3.8498 3.8834 9.0507 0.4975 11.3529 30.0006
temp: 298.150 k
press: 1.00000 atm
elementType: 8 8 8 8 8 8 6 6 6 6 6 6 6 6 6 6 6 6 1 1 1 1 1 1 1 1 1 1 1 1
symmnumber: 1
zpe: 580453.4 jmol-1
zpe.correction: 0.221083 hartree
zpe.thermalcorrener: 0.237889 hartree
zpe.thermalcorrenthalpy: 0.238833 hartree
zpe.thermalcorrgfe: 0.173767 hartree
zpe.sumelectzpe: -914.407958 hartree
zpe.sumelectthermal: -914.391152 hartree
zpe.sumelectthermalent: -914.390207 hartree
zpe.sumelectthermalfe: -914.455274 hartree
dipole: 1.9782 -3.9209 -0.6078
dipole: 4.4335
quadrupole: -85.5727 -102.2202 -110.6075
quadrupole: -7.5675 -13.3836 12.9891
quadrupole: 13.8941 -2.7534 -11.1407 -7.5675 -13.3836 12.9891
hfenergy: -914.6290407 hartree
pointgroup: C01 [X(C12H12O6)]
dipole: -0.8201129 1.4868232 -0.3990778 debye
polarizability: 178.8624742|-10.6914592|133.384562|-12.5998751|-7.7754214|114.2465771 unknown
InChI: InChI=1S/C12H12O6/c13-3-4-17-12(16)11-6-9(15)8-2-1-7(14)5-10(8)18-11/h1-3,5,8,10-11,14H,4,6H2
charge 0 multiplicity 1
30 atoms
O  0.222743 0.890469 1.307005
O  1.187093 -2.616747 -0.67656
O  -2.811789 0.889792 -0.559393
O  3.893113 1.616132 -1.925226
O  -2.586503 0.870704 1.768793
O  -4.272774 -1.429211 0.027081
C  1.951769 -0.902606 0.921946
C  1.648092 0.629999 1.008511
C  -0.662811 0.311001 0.297238
C  -0.560844 -1.242344 0.321428
C  0.884995 -1.673534 0.095314
C  3.346913 -1.168381 0.379742
C  2.122483 1.377361 -0.228644
C  3.255308 0.949671 -0.866894
C  3.941405 -0.294052 -0.478907
C  -2.084953 0.727836 0.640657
C  -4.26477 0.995063 -0.396136
C  -4.907377 -0.36736 -0.141989
H  1.85464 -1.301821 1.953465
H  2.148799 1.038925 1.908403
H  -0.405172 0.685622 -0.713632
H  -1.213275 -1.704684 -0.437535
H  -0.887704 -1.585569 1.322832
H  3.81778 -2.127262 0.61548
H  1.636908 2.336092 -0.453197
H  4.914524 -0.497193 -0.936272
H  3.410817 2.447898 -2.162246
H  -4.64849 1.426444 -1.337102
H  -4.522643 1.66845 0.446467
H  -6.026378 -0.335294 -0.110431
