program: Gaussian 09
title: 000005127
version: EM64L-G09RevD.01
frameworkgroup: C1[X(C11H16N2O2S)]
method: RPBEPBE
basis: SDD
operation: Freq
keyword: #p
keyword: freq=noraman
keyword: PBEPBE/SDD
title: #p freq=noraman PBEPBE/SDD
converged: YES YES NO NO
title: Mulliken charges:
elementType: S O O N N C C C C C C C C C C C H H H H H H H H H H H H H H H H
charge: 0.630608 -0.416120 -0.235856 -0.638468 -0.645595 -0.094686 -0.666105 -0.606767 0.498773 0.209034 -0.729450 -0.401124 -0.411509 -0.232095 -0.226228 -0.238264 0.269399 0.280632 0.275888 0.218968 0.245949 0.301502 0.263031 0.297139 0.254465 0.228172 0.247453 0.251757 0.227763 0.225252 0.386823 0.229658
chargesum: 0.00000
title: Mulliken charges with hydrogens summed into heavy atoms:
elementType: S O O N N C C C C C C C C C C C
charge: 0.630608 -0.029297 -0.235856 -0.391015 -0.393838 0.174713 -0.109585 -0.141850 0.498773 0.209034 0.132222 -0.146659 -0.183336 -0.004332 -0.000976 -0.008606
polarizability: 2.18621098e+02 1.12761767e+01 1.61716122e+02 1.67901064e+01 -3.81422804e+00 1.28277165e+02
1716.lowfreq: -14.3972 -6.6711 -5.8870 -0.0022 -0.0017 -0.0016 23.8202 37.7673 44.8762
frequency: 23.3936 37.6006 44.7758 60.7668 81.1321 94.2635 116.6918 125.9451 149.7764 152.4223 194.1386 201.5931 240.7885 270.6033 280.0052 300.5512 321.4274 344.6237 354.0778 391.8865 403.1961 442.3081 476.5514 521.0636 566.4248 587.6350 595.7093 617.0080 621.0937 663.4410 692.3620 706.1751 720.2835 745.4166 767.7265 812.5506 853.4513 856.2100 920.5453 954.4188 976.5324 990.0212 994.3382 998.7739 1026.3642 1027.3602 1039.2429 1041.3657 1071.0510 1082.4798 1115.8636 1137.3847 1171.2940 1173.3304 1183.9652 1189.5689 1198.9339 1214.9084 1259.1577 1281.7861 1309.6070 1331.2928 1347.6285 1371.3011 1383.6108 1408.6442 1428.8489 1441.8795 1444.5819 1468.5766 1483.4328 1593.0908 1613.5142 1664.3711 2999.3061 3029.6801 3041.5433 3043.2563 3065.5424 3111.1661 3124.0264 3130.0209 3135.0752 3146.2064 3163.6892 3187.2044 3189.3698 3245.4395 3245.7010 3522.6635
redmass: 4.3511 4.3273 5.3188 5.5136 4.0286 4.3712 4.1988 2.7448 2.3648 2.5104 2.8520 4.7476 3.8256 1.9406 2.3472 3.7388 2.0233 2.1418 4.5212 1.1746 2.8174 4.3554 4.9342 2.8507 2.1435 2.9632 2.7229 6.3006 8.6115 4.6952 4.7147 1.7535 7.1711 2.8698 2.1013 3.7829 1.3116 1.6311 1.4618 1.6196 1.3931 5.9191 1.7555 2.3626 1.6510 1.7382 1.4554 2.5796 1.7751 1.6681 1.4227 1.1027 1.1257 1.0872 1.2206 1.1261 1.2163 2.5783 1.4975 1.2180 1.3150 1.2633 1.1398 1.9036 5.3841 1.1463 1.0451 2.1354 1.0513 1.1250 2.2404 6.0239 6.0968 8.3679 1.0597 1.0571 1.0420 1.0683 1.1010 1.0878 1.0861 1.1101 1.0913 1.0960 1.1015 1.1058 1.1081 1.0752 1.0743 1.0639
irintensity: 0.0765 0.6648 0.0837 0.8749 1.2997 8.7784 3.7681 4.0189 1.7715 1.9063 7.9670 0.8126 1.4029 28.0861 4.9063 27.8081 18.9702 2.5863 23.0117 177.2476 0.1423 4.5575 2.5435 37.9889 60.6148 27.6700 50.8796 0.0486 129.5340 9.5254 76.6090 68.6198 39.0632 26.8108 39.5167 4.8703 1.0946 8.8076 2.0695 4.7804 0.1192 0.1310 3.6358 8.6973 17.3170 0.7242 10.1371 95.9686 94.2239 12.0868 10.4646 72.9703 1.3466 0.8107 6.4922 0.5124 17.3649 0.0524 0.0304 16.4350 2.2948 1.1182 15.9565 19.9068 1.8402 16.0753 11.5729 6.8385 12.3407 14.3668 18.8182 1.9832 9.6118 161.8335 21.5219 4.6890 2.5769 4.7788 10.3777 10.8547 0.8905 1.9730 12.4677 34.3825 24.6258 0.3778 1.3098 7.6525 17.9006 39.8453
temp: 298.150 k
press: 1.00000 atm
elementType: 16 8 8 7 7 6 6 6 6 6 6 6 6 6 6 6 1 1 1 1 1 1 1 1 1 1 1 1 1 1 1 1
symmnumber: 1
zpe: 658867.4 jmol-1
zpe.correction: 0.250949 hartree
zpe.thermalcorrener: 0.269150 hartree
zpe.thermalcorrenthalpy: 0.270094 hartree
zpe.thermalcorrgfe: 0.203484 hartree
zpe.sumelectzpe: -1085.360043 hartree
zpe.sumelectthermal: -1085.341843 hartree
zpe.sumelectthermalent: -1085.340899 hartree
zpe.sumelectthermalfe: -1085.407508 hartree
dipole: 2.5113 -1.4151 0.1420
dipole: 2.8861
quadrupole: -115.1448 -104.3778 -99.3743
quadrupole: -2.7317 7.0577 -1.7581
quadrupole: -8.8458 1.9212 6.9246 -2.7317 7.0577 -1.7581
hfenergy: -1085.6109926 hartree
pointgroup: C01 [X(C11H16N2O2S1)]
dipole: -1.01368 0.5085429 -0.0558339 debye
polarizability: 217.9645918|10.7006743|162.862465|-17.8200435|-3.3964823|127.7873283 unknown
InChI: InChI=1S/C11H16N2O2S/c1-16(12,13)8-10(11(14)15)7-9-5-3-2-4-6-9/h2-6,10,12-14H,7-8H2,1H3
charge 0 multiplicity 1
32 atoms
S  3.550714 0.423628 0.008986
O  0.6451 -0.948825 1.692133
O  0.598848 -2.183632 -0.280995
N  4.76554 1.404558 -0.748461
N  3.650587 -1.13775 0.761258
C  0.549882 0.288509 -0.377971
C  1.860326 0.572115 -1.121647
C  -0.648132 0.32464 -1.393632
C  -2.002922 0.252231 -0.702786
C  0.607264 -1.080333 0.305003
C  3.127627 1.477791 1.479396
C  -2.663672 -0.990571 -0.523421
C  -2.617866 1.428698 -0.201481
C  -3.908525 -1.054585 0.142695
C  -3.861611 1.367932 0.46545
C  -4.511058 0.123615 0.640613
H  0.379989 1.055454 0.397733
H  2.068192 -0.158076 -1.922979
H  1.946099 1.607596 -1.487998
H  -0.565655 1.261965 -1.975811
H  -0.521071 -0.520489 -2.094654
H  4.053676 1.524731 2.066434
H  2.845063 2.46781 1.098197
H  2.321481 0.96369 2.018442
H  -2.199452 -1.906978 -0.906978
H  -2.124847 2.399244 -0.343941
H  5.228408 0.798278 -1.472955
H  4.003331 -1.798712 0.022789
H  -4.408151 -2.021559 0.270079
H  -4.325945 2.286429 0.841992
H  0.834084 -1.83473 2.104743
H  -5.477406 0.074026 1.154769
