program: Gaussian 09
title: 000043356
version: EM64L-G09RevD.01
frameworkgroup: C1[X(C14H13N5)]
method: RPBEPBE
basis: SDD
operation: Freq
keyword: #pfreq=noraman
keyword: PBEPBE/SDD
title: #p freq=noraman PBEPBE/SDD
converged: YES YES NO NO
title: Mulliken charges:
elementType: N N N N N C C C C C C C C C C C C C C H H H H H H H H H H H H H
charge: -0.476545 -0.094262 -0.432700 -0.018269 -0.039007 0.499261 -0.630575 -0.395197 -0.400708 0.466199 0.314166 -0.226981 -0.226623 -0.234073 -0.376139 -0.274665 -0.311737 -0.347166 -0.123706 0.221655 0.216935 0.231964 0.230848 0.334008 0.228426 0.228408 0.231249 0.226099 0.319506 0.379417 0.240692 0.239523
chargesum: 0.00000
title: Mulliken charges with hydrogens summed into heavy atoms:
elementType: N N N N N C C C C C C C C C C C C C C
charge: -0.142537 -0.094262 -0.053283 -0.018269 -0.039007 0.499261 -0.191985 -0.163233 -0.169860 0.466199 0.314166 0.001444 0.001784 -0.002825 -0.150041 0.044841 -0.071045 -0.107644 -0.123706
polarizability: 2.40881873e+02 2.88527964e+01 2.03563231e+02 3.26202229e-02 1.04014458e+00 1.17687077e+02
1716.lowfreq: -26.7760 -4.4119 -0.7303 -0.0006 -0.0004 0.0004 4.3446 12.3567 36.2492
frequency: -26.6755 12.1599 36.2345 37.3854 60.2476 93.3886 108.9153 125.0369 191.8634 194.0953 233.7748 263.3996 323.1583 325.7535 349.4640 379.7449 400.2370 418.9909 485.3147 485.9873 524.6848 527.5878 543.3851 582.0867 617.1404 621.5443 659.2499 663.4183 677.4833 703.0512 739.9297 749.7155 814.7397 826.8662 832.6529 850.6155 882.1249 906.3685 925.4212 940.7173 955.7883 955.8346 973.5969 990.5858 991.7966 996.2895 1006.9306 1026.8804 1057.6473 1085.1029 1088.1865 1132.3437 1172.8028 1187.0221 1201.4618 1207.8218 1218.0345 1229.9670 1276.5689 1325.0795 1326.8963 1333.3365 1335.6270 1386.5795 1408.3529 1415.8373 1441.2545 1456.3530 1468.4506 1485.1612 1515.4261 1585.6752 1591.9311 1598.7612 1616.1550 1673.3356 2184.9853 2893.6813 2943.8206 3119.6887 3120.6221 3121.3669 3134.5711 3135.6141 3146.2855 3148.2249 3165.3272 3195.0631 3500.7932 3549.8154
redmass: 3.7171 5.3015 5.9558 4.8740 4.0240 9.4216 4.9719 5.8194 7.6034 6.1757 4.7466 4.5132 6.2186 2.2401 5.6392 2.6111 2.7972 1.2594 7.8139 4.1980 2.2695 4.9901 8.7592 1.4161 6.3274 5.7296 8.1039 6.9966 6.4208 1.7994 3.4785 2.0659 5.2404 1.4920 3.4392 1.2483 1.2627 4.0701 1.6700 1.7212 1.4868 5.3775 1.3916 5.6426 1.3650 1.3644 7.2140 2.2010 2.0733 1.5462 1.5666 3.9618 1.0535 1.1251 1.1115 3.2419 1.3950 2.9622 2.3877 2.0805 1.4790 1.7649 1.4804 7.9835 2.1936 1.3120 2.1625 1.1257 2.0004 2.3446 3.0534 5.4123 2.6989 6.1177 6.1948 6.1559 12.2399 1.0551 1.1030 1.0882 1.0859 1.0884 1.0906 1.0913 1.0979 1.0961 1.1016 1.0954 1.0763 1.0762
irintensity: 0.0010 1.4856 0.3912 3.2973 0.0729 3.7461 11.0521 4.1394 2.9411 3.5920 0.2082 0.5152 1.4050 0.1838 2.7992 0.0167 0.0510 99.3067 6.7038 15.4262 48.3528 0.9104 31.5622 11.2724 0.2001 7.5146 36.3619 1.9094 3.4944 51.3626 0.0111 52.0926 5.1496 80.6294 20.2589 0.0060 4.6888 16.0590 4.2391 2.9516 2.0689 11.5847 0.0506 1.5382 2.5246 0.9299 44.4658 10.7755 2.0811 7.3218 12.0235 34.2809 0.0131 2.1868 3.9724 69.3814 17.4643 121.3161 10.0472 119.4419 22.8306 57.0880 21.5174 0.2065 21.9197 80.8396 8.7333 8.2098 21.8877 6.6068 313.5084 389.2684 47.2489 0.8901 0.5616 600.1708 208.4092 75.2377 27.7795 8.4500 8.2128 3.4469 28.7839 12.5753 19.6200 39.0662 22.4240 12.7751 40.2503 68.4339
temp: 298.150 k
press: 1.00000 atm
elementType: 7 7 7 7 7 6 6 6 6 6 6 6 6 6 6 6 6 6 6 1 1 1 1 1 1 1 1 1 1 1 1 1
symmnumber: 1
zpe: 647135.9 jmol-1
zpe.correction: 0.246481 hartree
zpe.thermalcorrener: 0.262462 hartree
zpe.thermalcorrenthalpy: 0.263406 hartree
zpe.thermalcorrgfe: 0.200076 hartree
zpe.sumelectzpe: -813.675542 hartree
zpe.sumelectthermal: -813.659562 hartree
zpe.sumelectthermalent: -813.658618 hartree
zpe.sumelectthermalfe: -813.721947 hartree
dipole: -3.8433 2.9794 -0.0878
dipole: 4.8637
quadrupole: -111.6701 -127.1567 -108.2247
quadrupole: 0.5915 -0.2789 -0.0259
quadrupole: 4.0137 -11.4729 7.4592 0.5915 -0.2789 -0.0259
hfenergy: -813.9220234 hartree
pointgroup: C01 [X(C14H13N5)]
dipole: -1.5841239 -1.0731138 -0.023372 debye
polarizability: 236.9383034|-31.0434102|207.3839132|3.4312451|0.8600165|117.8099649 unknown
InChI: InChI=1S/C14H13N5/c15-11-18-14(19-13-6-8-16-9-7-13)17-10-12-4-2-1-3-5-12/h1-9,18-19H,10H2
charge 0 multiplicity 1
32 atoms
N  2.01284 -0.835391 0.082786
N  -0.36977 -0.715244 0.038387
N  0.777034 -2.853041 0.037712
N  3.272013 3.250744 0.130211
N  2.927443 -4.22315 0.04476
C  -2.818837 -0.393919 -0.05194
C  -1.682441 -1.406414 0.002014
C  -3.371573 0.129305 1.142544
C  -3.326197 0.051951 -1.296657
C  2.370561 0.533011 0.097661
C  0.737758 -1.398082 0.05228
C  -4.411065 1.085421 1.095316
C  -4.365729 1.008074 -1.348913
C  -4.911119 1.526997 -0.151791
C  3.757727 0.84907 0.126785
C  1.439374 1.604926 0.085172
C  4.149929 2.201068 0.14194
C  1.944747 2.923101 0.10208
C  1.899951 -3.600037 0.040535
H  -1.814624 -2.043957 0.906551
H  -1.756132 -2.072593 -0.888911
H  -2.981833 -0.205452 2.111726
H  -2.90124 -0.343078 -2.227656
H  2.799499 -1.491361 0.09654
H  -4.830036 1.483436 2.026222
H  -4.749218 1.345908 -2.318099
H  -5.71856 2.266689 -0.190166
H  4.518505 0.059051 0.137226
H  0.368759 1.398775 0.06328
H  -0.128145 -3.325829 0.02472
H  5.212991 2.466203 0.164476
H  1.248287 3.769417 0.092708
