program: Gaussian 09
title: 000005117
version: EM64L-G09RevD.01
frameworkgroup: C1[X(C14H19NO3)]
method: RPBEPBE
basis: SDD
operation: Freq
keyword: #p
keyword: freq=noraman
keyword: PBEPBE/SDD
title: #p freq=noraman PBEPBE/SDD
converged: YES YES NO NO
title: Mulliken charges:
elementType: O O O N C C C C C C C C C C C C C C H H H H H H H H H H H H H H H H H H H
charge: -0.250946 -0.244370 -0.440501 -0.114219 -0.118203 -0.222212 -0.365546 -0.365254 0.404054 -0.332424 -0.310261 0.128185 -0.377004 -0.567480 -0.359291 0.282811 -0.689407 -0.340851 0.255817 0.227459 0.196490 0.208123 0.225950 0.225750 0.174422 0.202066 0.189550 0.218706 0.216184 0.210685 0.233987 0.251081 0.209057 0.209753 0.223173 0.252958 0.351710
chargesum: 0.00000
title: Mulliken charges with hydrogens summed into heavy atoms:
elementType: O O O N C C C C C C C C C C C C C C
charge: -0.250946 -0.244370 -0.088792 -0.114219 0.137614 0.005247 0.039068 0.086446 0.404054 0.044063 0.097995 0.128185 0.049864 -0.333493 -0.108210 0.282811 -0.047424 -0.087892
polarizability: 2.20669278e+02 -6.45628406e+00 1.58827085e+02 -1.27278894e+01 -1.43388921e+01 1.19911361e+02
1716.lowfreq: -11.8372 -4.5593 -0.0002 0.0002 0.0006 8.2448 33.8267 53.0130 77.1726
frequency: 33.6569 52.9574 77.1517 88.8021 120.4457 150.5476 152.5643 192.6910 212.8332 229.7298 233.3743 268.0221 307.7695 317.2939 321.1830 324.6562 368.6967 376.8375 406.2711 426.6559 452.9513 464.3139 489.0482 531.4759 567.5744 590.9480 653.2700 673.2512 713.0166 716.8715 754.7009 773.8230 814.6177 822.3459 830.1196 858.4400 875.6061 883.4482 910.3835 923.7364 943.9882 949.3139 967.7262 993.5468 1025.9314 1047.3535 1052.2585 1083.9672 1097.2007 1104.5694 1113.2277 1130.0598 1132.0715 1143.7201 1166.1950 1180.7517 1193.1977 1217.0916 1221.4954 1246.9543 1252.1231 1259.3681 1266.7880 1294.7527 1305.0460 1311.1708 1311.4125 1319.2291 1332.9782 1352.0349 1362.9148 1373.6146 1386.7191 1395.9371 1397.4080 1436.6160 1447.2691 1460.5697 1468.0330 1475.4836 1480.0979 1482.1364 1490.8060 1493.8864 1606.4553 1627.2809 2847.2802 2882.7862 2948.5985 2955.0671 2975.2805 2982.9750 2996.5045 2996.8496 3014.4386 3017.9654 3038.5680 3072.4231 3079.0698 3081.2282 3096.0687 3112.6242 3157.4816 3178.7288 3587.5881
redmass: 4.9228 3.7519 1.6655 3.6226 3.9097 4.2352 4.2995 2.6122 2.9044 2.6244 1.3512 3.5006 4.6368 2.5620 1.4231 2.2670 4.9875 3.6490 5.1402 3.8781 3.9030 3.3023 5.5880 3.0611 4.0104 4.3941 5.8747 2.6443 4.0064 4.8131 1.1130 4.9417 1.9899 1.9951 1.9612 2.0770 2.4918 1.3914 1.9354 2.7083 3.0053 1.3510 5.7506 2.6397 3.2949 2.7650 2.5500 2.0636 2.2214 1.9750 2.3907 1.8317 1.7327 2.2748 1.3419 2.2090 1.9911 1.1834 1.3570 1.2502 1.6443 1.3886 1.7773 1.2516 1.2479 1.5593 1.2367 1.4865 1.4776 1.3936 1.2778 1.4118 1.4187 2.7317 1.7850 3.2742 1.0976 1.1811 1.0899 1.0638 1.0421 1.0702 2.6489 1.1114 7.2716 7.0683 1.0709 1.0699 1.0835 1.0666 1.0360 1.0630 1.0765 1.0728 1.0829 1.0872 1.1012 1.1012 1.0992 1.0974 1.1013 1.0916 1.0881 1.0974 1.0660
irintensity: 0.5828 0.1631 0.0452 0.4948 0.2582 1.6102 0.7917 4.1520 5.8430 2.1706 0.3011 0.4200 4.5020 30.6193 110.6558 3.2118 9.6155 3.4901 4.9563 16.4947 5.1117 10.7080 3.6778 1.6184 4.8956 5.9983 5.2579 11.2068 2.2026 31.2751 4.9425 10.5648 2.3422 1.9218 86.4337 3.7089 14.2448 3.6139 5.1302 21.5251 11.2925 0.4272 81.4363 3.8188 57.2493 17.1159 3.7684 7.1608 13.3909 35.8418 71.4265 6.1223 192.7171 7.9056 74.2516 25.9328 36.8351 7.7900 49.9013 9.2225 2.4000 12.0708 7.1412 18.5206 10.8151 1.9431 4.6118 2.6177 8.3760 10.9373 1.0033 3.4363 0.4238 11.3251 29.1414 143.8958 6.3022 7.6866 4.7744 2.2372 13.3733 3.4377 125.6473 9.2340 0.0324 7.2787 75.9132 93.3889 25.4770 80.1148 42.5559 10.7017 57.6863 8.3302 66.1456 38.7505 11.2334 73.8413 42.5290 36.6370 24.0701 12.7156 4.2374 7.1029 35.5551
temp: 298.150 k
press: 1.00000 atm
elementType: 8 8 8 7 6 6 6 6 6 6 6 6 6 6 6 6 6 6 1 1 1 1 1 1 1 1 1 1 1 1 1 1 1 1 1 1 1
symmnumber: 1
zpe: 809778.3 jmol-1
zpe.correction: 0.308428 hartree
zpe.thermalcorrener: 0.325103 hartree
zpe.thermalcorrenthalpy: 0.326047 hartree
zpe.thermalcorrgfe: 0.264416 hartree
zpe.sumelectzpe: -823.903013 hartree
zpe.sumelectthermal: -823.886338 hartree
zpe.sumelectthermalent: -823.885394 hartree
zpe.sumelectthermalfe: -823.947025 hartree
dipole: -3.5769 1.8003 -1.0915
dipole: 4.1505
quadrupole: -106.8985 -103.1408 -106.8946
quadrupole: 2.2507 -5.1878 -3.8526
quadrupole: -1.2539 2.5038 -1.2499 2.2507 -5.1878 -3.8526
hfenergy: -824.2114416 hartree
pointgroup: C01 [X(C14H19N1O3)]
dipole: -1.431139 0.6609407 -0.4260117 debye
polarizability: 221.0158754|-4.2965944|158.5497065|-12.3379603|-14.641437|119.8421424 unknown
InChI: InChI=1S/C14H19NO3/c1-2-5-15-6-7-17-14-11-8-10(16)3-4-13(11)18-9-12(14)15/h3-4,8,12,14,16H,2,5-7,9H2,1H3
charge 0 multiplicity 1
37 atoms
O  0.015424 2.060607 0.524072
O  0.345839 -1.650358 1.173858
O  5.007586 0.547051 -1.105387
N  -2.417391 0.659401 -0.142534
C  -1.131463 -0.077997 -0.060531
C  0.049872 0.870745 -0.371638
C  -2.451311 1.891624 0.681924
C  -0.843341 -0.773382 1.295409
C  1.378438 0.174077 -0.166957
C  -3.64542 -0.163972 -0.007079
C  -1.254308 2.786799 0.331093
C  1.465118 -1.032341 0.575578
C  -3.7475 -1.308549 -1.035895
C  2.5603 0.712613 -0.731099
C  2.705379 -1.696959 0.726316
C  3.798152 0.057208 -0.568598
C  -5.131378 -1.99236 -0.987309
C  3.870656 -1.157209 0.155723
H  -1.133418 -0.863332 -0.840297
H  -0.054328 1.230893 -1.418527
H  -2.446803 1.682622 1.779612
H  -3.389645 2.434104 0.454983
H  -0.65233 -0.024453 2.088621
H  -1.65563 -1.451874 1.599739
H  -3.767083 -0.588351 1.022956
H  -4.503791 0.520095 -0.161946
H  -1.336882 3.123348 -0.725015
H  -1.195892 3.661981 0.999309
H  -3.561417 -0.89329 -2.045084
H  -2.96502 -2.070045 -0.850071
H  2.494711 1.653608 -1.293749
H  2.737819 -2.628585 1.298789
H  -5.341046 -2.400376 0.019757
H  -5.938996 -1.278747 -1.236535
H  -5.186871 -2.829215 -1.706329
H  4.839044 -1.653641 0.265528
H  4.859725 1.406759 -1.571187
