program: Gaussian 09
title: 000043434
version: EM64L-G09RevD.01
frameworkgroup: C1[X(C22H32BrClNO2)]
method: RPBEPBE
basis: SDD
operation: Freq
keyword: #p
keyword: freq=noraman
keyword: PBEPBE/SDD
title: #p freq=noraman PBEPBE/SDD
converged: NO YES NO NO
title: Mulliken charges:
elementType: Br Cl O O N C C C C C C C C C C C C C C C C C C C C C C H H H H H H H H H H H H H H H H H H H H H H H H H H H H H H H H
charge: 0.142925 -0.051925 -0.223043 -0.306303 -0.096574 -0.352789 -0.497035 -0.409780 -0.557759 -0.577270 -0.357153 0.359302 -0.397533 -0.310841 -0.379459 -0.167710 0.221334 0.457911 -0.227833 -0.103937 -0.470082 -0.403385 -0.693422 -0.693582 0.530352 -0.457358 -0.796702 0.263769 0.293371 0.287158 0.289211 0.225050 0.222655 0.269193 0.255736 0.272658 0.284567 0.274297 0.253373 0.201618 0.242132 0.221756 0.204820 0.205486 0.243990 0.280600 0.289246 0.222644 0.240761 0.220032 0.215284 0.218640 0.212765 0.225268 0.218727 0.241840 0.247046 0.246108 0.229852
chargesum: 1.00000
title: Mulliken charges with hydrogens summed into heavy atoms:
elementType: Br Cl O O N C C C C C C C C C C C C C C C C C C C C C C
charge: 0.142925 -0.051925 -0.223043 -0.306303 -0.096574 0.204351 0.079334 0.037925 0.239828 0.234967 0.086597 0.359302 0.029042 0.138634 -0.098859 0.121536 0.221334 0.457911 -0.005189 -0.103937 -0.470082 -0.162625 -0.039466 -0.036822 0.530352 -0.215519 -0.073696
polarizability: 3.18324280e+02 -8.34673000e+00 3.24288079e+02 1.73378100e+01 -1.09101748e+00 1.85553901e+02
1716.lowfreq: -11.2184 -6.0098 -5.4129 -3.3676 0.0011 0.0013 0.0016 4.6088 13.6606
frequency: -5.6529 -1.7006 9.7301 18.5946 20.1307 36.3490 45.9443 54.3299 60.8391 91.2911 94.1654 100.8117 103.2666 123.0323 127.0223 141.6495 161.2119 169.4071 176.2063 204.3543 206.4294 218.8943 224.6154 227.5122 236.0538 244.9695 258.1476 265.6099 276.0576 287.2645 295.3486 306.6027 309.8286 352.7063 360.9165 373.7356 397.7144 403.2424 411.0983 419.3017 451.2465 457.3099 489.2276 529.6832 541.7350 582.7194 601.6326 603.8876 610.0879 629.9283 697.6703 721.5642 738.8373 743.3804 755.1670 768.0288 783.4592 794.7996 817.7553 831.5808 846.7783 862.9439 889.5602 890.7751 896.7054 902.7928 918.4927 919.9597 926.0857 952.4716 954.6521 959.2496 963.3815 976.3838 1016.7201 1024.5385 1030.5477 1047.6356 1048.9569 1058.1686 1067.8858 1071.6842 1080.2613 1086.4469 1096.0148 1101.9014 1113.6115 1141.4096 1159.5328 1166.9197 1177.6326 1190.8366 1203.0481 1208.0915 1220.4743 1231.9058 1255.5722 1263.7929 1266.8392 1274.3940 1286.2027 1301.8073 1303.8561 1311.9968 1322.3639 1328.7564 1342.8906 1351.0147 1360.7016 1365.9435 1369.5821 1377.8836 1380.3963 1388.7723 1401.6777 1404.4433 1418.9256 1432.3752 1442.5035 1451.8535 1458.4211 1460.2378 1463.2221 1465.7767 1467.5971 1467.9707 1469.3711 1470.9385 1472.6961 1472.7177 1475.5694 1479.8027 1482.8877 1486.9831 1489.8028 1493.6442 1560.1046 1584.0863 1609.4511 2961.9012 2975.9253 2976.4191 2978.2362 2985.8730 2988.3593 2989.8793 3010.1194 3021.2377 3024.9120 3027.8369 3030.9114 3032.0128 3044.1802 3050.6402 3066.8667 3067.7219 3070.0428 3074.8382 3077.1159 3082.4960 3099.7140 3102.4528 3106.0123 3130.3500 3135.7921 3139.6317 3151.4812 3153.0707 3154.7581 3219.2889 3253.7477
redmass: 4.8910 5.6140 3.8069 4.6100 11.0147 2.9559 3.0165 4.5188 3.7282 3.2067 4.0598 2.0645 3.3801 1.0362 2.4014 4.2827 3.9568 3.2993 5.1516 1.3998 1.3129 2.4482 2.2983 2.4799 1.1183 1.2776 3.1448 3.3026 4.2130 3.6893 3.9041 3.5888 3.5449 3.1690 4.3963 2.3026 3.6017 3.4572 3.5050 3.3988 2.6396 3.2197 3.7191 3.8952 3.6065 3.4271 3.7911 4.0170 5.4047 3.8712 4.0610 3.8437 1.5188 3.5506 2.5303 2.2581 3.4571 2.5004 1.2783 1.3772 2.4235 2.9132 2.6345 1.4961 2.5994 3.5398 3.7920 1.2009 2.0885 2.4636 1.4665 1.3272 2.1473 1.8976 2.4985 1.5646 2.1160 1.5261 3.0325 1.6368 1.7883 3.9603 1.6197 3.0926 1.4481 2.4353 2.6586 1.6575 1.5281 1.9687 1.3722 1.4739 1.4501 1.5253 1.4307 2.5436 2.5366 1.8253 1.5466 1.4516 1.3513 1.0966 1.8617 1.2623 1.3229 1.3353 2.1016 1.4110 2.4069 1.5589 1.9272 1.3395 1.2126 2.3991 1.2263 1.2230 1.1478 1.1364 1.1319 1.0880 1.0795 1.0766 1.0446 1.0514 1.0881 1.7156 1.0862 1.5441 1.2431 1.9235 1.1762 1.0567 1.0808 1.0736 1.2081 1.0745 5.3707 6.7681 7.7203 1.0625 1.0351 1.0614 1.0356 1.0598 1.0372 1.0609 1.0840 1.0604 1.0358 1.0435 1.0508 1.0923 1.1005 1.1035 1.1045 1.0973 1.1001 1.1003 1.0994 1.0994 1.0997 1.1055 1.1063 1.0871 1.1048 1.1044 1.1045 1.0967 1.1043 1.0976 1.1026
irintensity: 1.1100 1.1563 1.3825 0.3811 0.5695 0.1686 0.8828 1.9726 2.3627 3.1886 1.0686 0.7333 0.4327 0.4145 1.4173 0.6080 2.4025 3.0058 6.5634 0.4935 0.5122 0.3499 0.6621 0.6297 0.8169 1.3968 0.6998 2.5807 1.0499 0.4571 1.9990 0.9954 2.9356 3.3074 1.1214 0.8418 4.4505 0.0372 3.4955 0.3960 1.4809 0.7174 0.1640 4.2988 0.3644 2.7210 4.8908 1.0554 1.6600 15.9810 0.6762 15.4500 34.6037 6.1663 8.0699 4.7050 152.9109 1.9079 45.3548 29.2902 6.6262 6.2383 20.4596 1.7560 17.8536 4.2741 29.3347 1.4124 7.6807 20.0969 0.2386 0.3304 39.1359 6.3971 8.7134 66.7720 78.9537 7.5525 16.6102 10.6600 6.1110 35.6803 9.2225 22.5937 3.0818 7.9506 1.2501 1.6952 3.5109 6.1365 7.8486 10.6922 15.6242 2.0991 11.2248 4.2152 55.4767 18.0439 5.0297 6.2817 2.8048 31.3238 38.8453 13.9773 3.4719 3.4192 6.0958 17.3534 19.7542 3.3615 13.0264 2.6502 16.5508 17.1203 17.2944 14.5695 25.1197 6.3011 34.8614 5.2375 5.0811 25.0535 15.9770 1.5960 16.4066 21.7527 6.3887 89.1718 11.7094 73.4267 3.8836 11.2631 5.9332 63.6990 29.6677 63.4548 2.6221 15.7466 4.3570 35.8115 32.3778 10.0338 32.4350 4.9252 18.6580 45.5614 8.0136 8.0238 1.0856 2.2981 7.7093 7.6875 10.4391 13.4058 47.9359 12.6021 0.7110 36.4105 74.4414 44.9638 16.1030 10.0497 0.8879 8.4533 2.2747 9.5623 1.6170 16.7466 5.3828 0.6349 4.4631
temp: 298.150 k
press: 1.00000 atm
elementType: 35 17 8 8 7 6 6 6 6 6 6 6 6 6 6 6 6 6 6 6 6 6 6 6 6 6 6 1 1 1 1 1 1 1 1 1 1 1 1 1 1 1 1 1 1 1 1 1 1 1 1 1 1 1 1 1 1 1 1
symmnumber: 1
zpe: 1299672.0 jmol-1
zpe.correction: 0.495019 hartree
zpe.thermalcorrener: 0.524152 hartree
zpe.thermalcorrenthalpy: 0.525096 hartree
zpe.thermalcorrgfe: 0.431772 hartree
zpe.sumelectzpe: -1533.899035 hartree
zpe.sumelectthermal: -1533.869902 hartree
zpe.sumelectthermalent: -1533.868958 hartree
zpe.sumelectthermalfe: -1533.962282 hartree
dipole: -13.9535 -9.3269 0.7589
dipole: 16.8008
quadrupole: -73.1260 -128.7445 -168.5251
quadrupole: 44.0059 -3.5722 -7.3210
quadrupole: 50.3392 -5.2793 -45.0599 44.0059 -3.5722 -7.3210
hfenergy: -1534.3940537 hartree
pointgroup: C01 [X(C22H32Br1Cl1N1O2)]
dipole: -5.8540624 3.021203 -0.5420033 debye
polarizability: 315.1273996|3.9481655|321.760358|-22.9816987|-24.0448227|191.2785023 unknown
InChI: InChI=1S/C22H32BrClNO2/c1-16(2)19-11-9-17(3)21(24)22(19)26-14-8-6-7-13-25(4,5)15-18-10-12-20(23)27-18/h9-12,16H,6-8,13-15H2,1-5H3
charge 1 multiplicity 1
59 atoms
Br -5.328768 -3.474188 1.336543
Cl 4.191875 2.662861 0.055693
O  -5.046638 -1.021345 -0.03036
O  2.313007 0.314428 0.28489
N  -3.933353 2.069257 -0.576514
C  -2.75265 1.180168 -0.094631
C  -5.032348 1.138384 -1.236477
C  -1.60339 1.916191 0.610275
C  -3.46657 3.041558 -1.653821
C  -4.546801 2.842983 0.581415
C  -0.452397 0.916905 0.898643
C  -5.715134 0.204892 -0.314192
C  0.741382 1.601836 1.601204
C  1.971073 0.692149 1.682193
C  -6.96453 0.189896 0.294631
C  -7.102134 -1.066199 0.991865
C  3.655687 -0.082168 0.066741
C  3.974243 -1.460775 -0.065686
C  2.898887 -2.539966 0.077544
C  -5.92562 -1.766869 0.772707
C  4.667498 0.898006 -0.092805
C  5.320209 -1.794409 -0.357596
C  3.227557 -3.526546 1.229408
C  2.693065 -3.299536 -1.260899
C  6.013056 0.576745 -0.37969
C  6.312369 -0.805718 -0.505771
C  7.082733 1.634559 -0.554961
H  -2.381937 0.66469 -0.999423
H  -3.196243 0.419681 0.568876
H  -5.766673 1.825779 -1.687646
H  -4.500825 0.598928 -2.039686
H  -1.94322 2.361571 1.564543
H  -1.197219 2.73199 -0.017393
H  -3.025529 2.472202 -2.486535
H  -4.330007 3.622714 -2.013529
H  -2.715448 3.724955 -1.234511
H  -4.841837 2.137372 1.371179
H  -3.809694 3.559615 0.970212
H  -5.433796 3.385661 0.2179
H  -0.825512 0.079613 1.523054
H  -0.087893 0.480513 -0.050485
H  1.031642 2.512044 1.042401
H  0.46092 1.912902 2.62744
H  1.766553 -0.233065 2.26069
H  2.820806 1.226446 2.145488
H  -7.719302 0.973474 0.240562
H  -7.957075 -1.411173 1.56725
H  1.948872 -2.028017 0.320872
H  5.59784 -2.848534 -0.468005
H  3.362627 -2.996792 2.190078
H  2.412072 -4.263479 1.351468
H  4.156742 -4.0894 1.024251
H  1.88102 -4.043848 -1.162581
H  2.432364 -2.60421 -2.078933
H  3.609929 -3.841096 -1.558253
H  7.344383 -1.097787 -0.728928
H  6.838421 2.319412 -1.38745
H  7.184103 2.25986 0.350706
H  8.059609 1.169481 -0.76546
