program: Gaussian 16
title: Title Card Required
version: ES64L-G16RevC.01
method: RwB97XD
basis: def2SVPP
operation: Freq
keyword: #N
keyword: Geom=AllCheck
keyword: Guess=TCheck
keyword: SCRF=Check
keyword: GenChk
keyword: RwB97XD/def2SVPP
keyword: Freq
converged: YES YES YES YES
title: Mulliken charges:
elementType: B F C C C C C O O C H H H C H H H Si C H H H C H H H C H H H C H H H C C C C H C H C H H H C C C C H C H C H H H C C C C O O H H H H H H C H H H C C C C F C F C F F F C C C C F C F C F F F C C C C F C F C F F F
charge: 0.300730 -0.241890 0.092954 0.142462 -0.057929 -0.376185 0.428160 -0.460720 -0.286757 -0.308968 0.148460 0.161399 0.163041 -0.225765 0.128030 0.147608 0.141963 0.765102 -0.615444 0.168573 0.174538 0.174251 -0.603219 0.168519 0.159890 0.191028 -0.608398 0.176188 0.170632 0.169476 -0.181481 0.174027 0.169487 0.157821 0.059413 -0.125098 -0.142049 -0.116287 0.144968 -0.114666 0.109766 -0.088932 0.109933 0.113460 0.118683 0.093150 -0.144300 -0.088494 -0.109967 0.102455 -0.116891 0.100966 -0.087832 0.116415 0.106243 0.115403 -0.320799 0.298335 -0.292044 -0.288434 -0.257362 -0.303901 0.154844 0.145110 0.151958 0.152610 0.155647 0.163742 -0.155505 0.169129 0.147700 0.144109 -0.173102 0.140907 0.138041 0.219778 -0.202749 0.201514 -0.191157 0.097717 -0.192097 -0.194904 -0.189643 -0.068572 0.139194 0.117895 0.217537 -0.196763 0.215490 -0.206039 0.095153 -0.189137 -0.193154 -0.190581 -0.160364 0.146875 0.124807 0.234832 -0.201546 0.216925 -0.199275 0.091126 -0.191843 -0.194811 -0.191118
chargesum: -0.00000
title: Mulliken charges with hydrogens summed into heavy atoms:
elementType: B F C C C C C O O C C Si C C C C C C C C C C C C C C C C C C C C O O C C C C C F C F C F F F C C C C F C F C F F F C C C C F C F C F F F
charge: 0.300730 -0.241890 0.092954 0.142462 -0.057929 -0.376185 0.428160 -0.460720 -0.286757 0.163932 0.191836 0.765102 -0.098082 -0.083781 -0.092102 0.319853 0.059413 0.019871 -0.032283 -0.006354 -0.001206 0.029751 0.093150 -0.041844 0.012472 0.006448 -0.010648 0.027571 -0.320799 0.298335 0.159868 0.183566 -0.257362 -0.303901 0.305433 -0.173102 0.140907 0.138041 0.219778 -0.202749 0.201514 -0.191157 0.097717 -0.192097 -0.194904 -0.189643 -0.068572 0.139194 0.117895 0.217537 -0.196763 0.215490 -0.206039 0.095153 -0.189137 -0.193154 -0.190581 -0.160364 0.146875 0.124807 0.234832 -0.201546 0.216925 -0.199275 0.091126 -0.191843 -0.194811 -0.191118
1716.lowfreq: -351.7607 -5.0932 -0.0007 -0.0003 0.0004 5.4822 7.8139 19.3880 22.0057
redmass: 8.7312 6.5775 8.6475 12.7296 7.6714 9.4258 9.2986 10.3061 12.6868 11.2450 7.8015 8.9221 7.3876 6.2166 5.0276 3.9755 5.3763 4.9588 5.9644 4.3002 4.5423 5.1557 5.2213 13.2535 4.0922 4.3650 7.6202 4.0508 6.0497 7.3643 4.6307 12.0296 14.6669 4.4054 14.7969 14.6411 13.7295 1.1562 11.7049 2.7288 10.5904 1.1727 15.5008 4.0589 6.4376 2.1605 2.1540 1.3528 2.7628 3.2073 1.4569 1.9746 1.2070 2.5314 5.9289 4.2033 5.1356 2.4166 3.4934 3.0011 3.6003 12.8093 3.2152 5.8160 2.7314 18.5289 15.5087 17.3780 2.2149 2.6351 9.8008 16.8367 14.4292 2.0348 2.0173 1.4238 1.4205 3.0412 11.4135 16.8578 16.7038 14.9545 3.0997 3.2756 17.0026 17.1877 16.2157 3.3003 1.9928 13.0273 4.4640 12.3541 12.3665 2.8818 10.4884 10.7121 3.3122 3.8988 15.6085 15.6329 15.6683 12.8188 4.8004 5.1382 10.9004 14.0557 15.7566 4.5105 4.7407 5.2084 12.4524 13.6045 15.6013 15.9079 16.7794 4.9756 4.4018 4.3518 11.3969 6.3601 12.5207 6.2773 12.8163 3.7248 11.9459 5.2452 12.1665 12.1592 12.2821 1.1884 1.7044 1.6521 1.7272 11.3212 3.2355 2.0339 7.1827 12.5315 6.1462 12.5594 4.6774 1.6492 12.7230 1.7872 3.0212 3.3058 9.1617 2.4989 3.9384 13.4623 1.6153 1.2691 1.7569 1.7514 1.3159 3.0117 2.8142 9.5735 1.8479 1.6800 1.3894 10.3300 1.5656 1.5133 1.9959 12.0220 1.9655 3.7118 1.5159 13.0023 2.1571 1.7540 4.5907 11.1929 1.3610 1.3732 1.3987 2.3641 2.4438 3.5767 2.3837 1.8041 1.4952 1.6068 13.2504 2.4483 13.1856 9.7503 3.3447 7.6668 1.3161 1.1547 4.1741 12.8897 1.2791 1.4676 2.0718 1.1200 1.1364 2.1599 1.4806 2.4721 2.5192 3.7616 3.2314 1.2996 1.2982 1.2523 12.2974 12.4487 12.1581 11.9427 1.5278 11.1930 3.2477 2.3489 4.1767 5.1791 4.8237 1.7834 2.0802 1.9136 1.9810 1.4647 1.4800 1.5095 1.0695 1.0563 1.0590 11.9053 1.0598 11.4654 1.0642 1.0599 11.2946 1.0627 1.0502 1.0723 1.0602 1.0603 1.1820 1.0957 1.0568 1.0578 1.1369 2.3444 1.5819 1.2989 1.0918 1.0539 2.0577 11.1473 12.0450 12.1767 2.5767 2.7683 12.2883 12.3462 12.3695 6.4964 6.1885 6.1872 6.2699 6.3359 12.0415 12.0337 12.0226 12.0382 12.0352 12.0330 12.0653 11.9036 1.0452 1.0382 1.0437 1.0382 1.0377 1.0369 1.0375 1.0324 1.0318 1.0976 1.0963 1.1026 1.1017 1.1029 1.1038 1.1032 1.1037 1.1057 1.1046 1.1097 1.1028 1.1103 1.1035 1.1046 1.1051 1.1096 1.0870 1.0872 1.1090 1.0922 1.0920 1.0974 1.0977 1.0961 1.0941 1.0944 1.0921
irintensity: 1143.9226 0.2263 0.3844 0.5845 0.3108 1.3755 0.6468 0.0638 0.7128 0.6961 0.4255 0.3905 0.2087 1.0057 0.6695 0.2723 0.3794 0.3058 2.1763 2.0052 0.8732 1.9192 3.1076 1.3915 1.0663 0.6321 0.6226 5.5429 1.5777 1.7225 2.8659 0.0726 0.0129 0.2615 0.2031 0.7370 0.1844 0.0406 0.5072 0.7685 0.4529 0.2436 0.1142 1.7429 0.8979 0.4673 0.1102 0.9611 0.4654 6.3198 2.2884 0.7271 0.1952 2.4939 6.5640 4.6086 2.8797 1.7988 10.9288 10.3551 0.1386 1.5104 13.0029 1.2513 4.7241 0.0606 0.4775 0.1870 1.2655 8.7851 1.0887 0.0472 0.9994 9.7078 6.4338 4.9693 3.9469 11.5884 7.0809 1.2521 1.0372 3.2719 13.5366 22.3289 6.5295 7.1676 2.2261 12.4263 3.1393 0.8152 11.1489 0.1838 0.0242 2.4602 1.0263 0.6492 0.2143 8.5108 0.1437 0.1132 0.7384 1.1398 31.1369 7.8903 6.0146 3.9395 0.2211 21.3090 67.7104 54.9014 0.7570 0.9864 2.3065 2.4078 0.7492 12.5006 35.2833 40.0394 7.9559 0.6351 36.8977 0.4541 61.7840 67.2202 1.4488 23.6340 1.1683 0.5735 14.3427 0.5072 3.6380 51.9693 6.9228 79.1533 45.0475 56.9170 0.4191 96.5286 20.7155 14.6570 7.3447 24.8983 50.5408 25.3302 21.6706 30.7334 31.7537 64.8470 37.2897 47.7714 278.0101 4.5903 164.3567 177.2528 28.3067 186.4006 35.4333 43.8157 0.6654 15.6317 7.4182 89.1130 2.2922 16.7453 46.2836 471.2058 34.4991 60.9713 4.0084 267.6796 7.0419 11.6052 8.6614 118.7863 3.1345 1.1083 1.0430 15.9754 22.3927 20.8573 96.7347 42.9456 1.4805 18.2536 122.3146 35.5033 413.7059 444.0082 137.3363 0.6467 1.4430 1.1163 9.5455 1.4923 2.3034 5.8632 5.9714 10.6474 6.0119 100.7597 11.9069 75.6571 73.1306 477.2873 18.1621 67.4600 78.8501 43.8067 21.2410 55.8557 72.4208 12.0626 47.2231 7.4625 322.0714 22.1696 108.0907 2.2442 8.2592 49.3049 426.7218 59.7444 76.6627 100.9898 84.6199 29.5716 1.4093 1.0678 2.7138 30.0766 9.4091 23.6901 2.5474 24.9891 0.6717 4.2714 7.4222 26.6607 4.6783 4.2886 48.4293 47.5141 12.5967 27.5469 34.0669 3.3072 6.4530 29.3827 24.2948 30.7636 254.1251 402.4064 903.2565 898.3698 6.2798 19.2023 236.2132 231.5410 175.3208 981.7291 0.5465 1.6506 2.1362 19.0831 1.7070 7.8355 3.4207 83.9903 69.7695 67.1883 483.3644 26.5947 33.0852 1.9036 50.3184 2.4121 5.5838 20.6206 34.1494 43.6863 21.8317 13.7015 19.6265 0.8851 6.0419 3.2381 5.2770 3.3137 1.4876 9.9133 14.7540 14.7611 11.2984 12.3851 4.6842 6.3911 5.5811 7.6207 0.9166 0.1973 5.1159 9.8157 9.3404 23.0478 20.1416 8.5702 4.5593 2.6641 4.7261
temp: 298.150 k
press: 1.00000 atm
elementType: 5 9 6 6 6 6 6 8 8 6 1 1 1 6 1 1 1 14 6 1 1 1 6 1 1 1 6 1 1 1 6 1 1 1 6 6 6 6 1 6 1 6 1 1 1 6 6 6 6 1 6 1 6 1 1 1 6 6 6 6 8 8 1 1 1 1 1 1 6 1 1 1 6 6 6 6 9 6 9 6 9 9 9 6 6 6 6 9 6 9 6 9 9 9 6 6 6 6 9 6 9 6 9 9 9
symmnumber: 1
zpe: 1974935.3 jmol-1
zpe.correction: 0.752213 hartree
zpe.thermalcorrener: 0.819771 hartree
zpe.thermalcorrenthalpy: 0.820715 hartree
zpe.thermalcorrgfe: 0.649394 hartree
zpe.sumelectzpe: -3983.103297 hartree
zpe.sumelectthermal: -3983.035739 hartree
zpe.sumelectthermalent: -3983.034795 hartree
zpe.sumelectthermalfe: -3983.206116 hartree
dipole: 26.3310 0.6800 0.3851
dipole: 26.3426
quadrupole: -332.6558 -402.3378 -387.4313
quadrupole: 3.6938 6.1796 6.5346
quadrupole: 41.4858 -28.1961 -13.2897 3.6938 6.1796 6.5346
hfenergy: -3983.8555104 hartree
pointgroup: C01 [X(C46H37B1F16O4Si1)]
dipole: 10.3594071 0.2675288 0.1515217 debye
polarizability: 607.0542796|18.9717438|709.7948836|33.4505321|15.3285841|687.1182666 unknown
InChI: InChI=1S/C20H19O2.C18BF16.C8H18O2Si/c1-20(2,19(21)22-3)18-16(14-10-6-4-7-11-14)17(18)15-12-8-5-9-13-15;20-4-1(5(21)11(27)16(32)10(4)26)19(35,2-6(22)12(28)17(33)13(29)7(2)23)3-8(24)14(30)18(34)15(31)9(3)25;1-7(2)8(9-3)10-11(4,5)6/h4-13H,1-3H3;;1-6H3
charge 0 multiplicity 1
105 atoms
B  -1.67975146 0.36265799 -0.13345652
F  -0.26239955 0.39393516 0.04305745
C  2.40133458 -1.95070049 0.45843711
C  2.48133442 -0.62401417 0.59201332
C  2.42414053 -1.16839101 -0.72913342
C  4.43678378 -1.32542248 -1.68628965
C  4.61757537 0.03094881 -1.42680239
O  4.9519354 0.4862699 -0.25683392
O  4.31922901 0.90933313 -2.36404522
C  5.11215582 -2.30470914 -0.76702522
H  4.68284431 -3.31092219 -0.90277056
H  6.19390793 -2.38062401 -0.98687193
H  5.00814726 -2.02004692 0.29028742
C  4.26214248 -1.77062312 -3.1153041
H  3.77478244 -2.75839534 -3.15561762
H  3.66116509 -1.06502969 -3.70628534
H  5.25197259 -1.86971526 -3.60061546
Si 6.35734802 0.89096516 0.68079809
C  6.55269698 -0.42225474 1.99123658
H  6.90096683 -1.3810497 1.57218821
H  7.29877788 -0.0856571 2.73410395
H  5.60143445 -0.59327697 2.52380701
C  5.94300839 2.54975321 1.41485342
H  6.75908334 2.88467133 2.07995079
H  5.80025066 3.3170785 0.63489969
H  5.0169125 2.4862387 2.01275141
C  7.7821744 0.92563928 -0.52490971
H  8.71533346 1.18633002 0.00621275
H  7.92939356 -0.06064501 -0.99940727
H  7.62733407 1.6748698 -1.3209282
C  4.30287587 2.29829776 -2.05874302
H  5.32884066 2.67504917 -1.9190579
H  3.84675072 2.78643696 -2.9292272
H  3.70747017 2.49867437 -1.15442377
C  2.49539749 0.51684203 1.48838905
C  2.11569782 1.79078305 1.05043926
C  2.88457793 0.33670338 2.82438919
C  2.13077813 2.86821533 1.93004861
H  1.74989778 1.92901293 0.03426815
C  2.90773378 1.41753168 3.70081022
H  3.15888166 -0.65893124 3.17766946
C  2.52918182 2.6859743 3.2547415
H  1.81241079 3.85371922 1.58077854
H  3.2158896 1.26863968 4.73904701
H  2.5397921 3.53387538 3.94526322
C  1.6216614 -1.00112113 -1.94616857
C  1.16980635 -2.11853435 -2.66060882
C  1.31904269 0.2790312 -2.42323254
C  0.43959475 -1.95507532 -3.83414654
H  1.39792637 -3.12349558 -2.30062485
C  0.57739856 0.44288573 -3.58840518
H  1.64197261 1.15625224 -1.86623314
C  0.14252688 -0.67430862 -4.30165653
H  0.08657132 -2.83447477 -4.37980115
H  0.32840115 1.44974695 -3.93311416
H  -0.45150109 -0.54853551 -5.2111418
C  2.19931068 -3.27837753 1.12050633
C  1.04376951 -3.19114193 2.13683042
C  1.8835967 -4.37842906 0.10372399
C  3.44381179 -3.66540405 1.95969964
O  0.37393092 -4.13840705 2.45244193
O  0.93750545 -1.98836927 2.67784672
H  2.67595154 -4.43112998 -0.66100609
H  1.8220631 -5.352472 0.6119973
H  0.91731708 -4.19710609 -0.38991916
H  3.19869723 -4.53793968 2.58709218
H  4.28078492 -3.94458633 1.30329432
H  3.76780736 -2.84014167 2.61370865
C  -0.06505648 -1.79301026 3.66587937
H  0.05552049 -0.75766259 4.01130847
H  -1.06312137 -1.93337208 3.2214831
H  0.07198078 -2.49732411 4.50127257
C  -2.34273676 0.19676483 1.3794946
C  -3.35113775 -0.68238982 1.76637183
C  -1.85182389 1.0113586 2.39944039
C  -3.81366594 -0.79127499 3.07742523
F  -3.93863223 -1.49192461 0.88185314
C  -2.27698865 0.93083414 3.72330479
F  -0.92021077 1.9308334 2.14314917
C  -3.27062343 0.02170941 4.06568356
F  -4.77266266 -1.65703761 3.38933937
F  -1.73594896 1.7054978 4.65927732
F  -3.69276105 -0.07199865 5.3197565
C  -1.99463217 -0.92068058 -1.12353725
C  -1.63914858 -2.19781113 -0.69416109
C  -2.52975639 -0.87301591 -2.40583548
C  -1.84311859 -3.35531009 -1.43344095
F  -1.08786745 -2.36464701 0.51458615
C  -2.75125408 -2.00647506 -3.18884278
F  -2.85088862 0.28654161 -2.98648081
C  -2.39709431 -3.25629249 -2.70457112
F  -1.47599183 -4.54467656 -0.9610006
F  -3.22925827 -1.88819522 -4.424336
F  -2.55512782 -4.33910607 -3.45514332
C  -2.22464167 1.80138083 -0.73335037
C  -3.59527806 2.04576708 -0.80465431
C  -1.42159059 2.85845365 -1.14899738
C  -4.15192304 3.23976475 -1.24822455
F  -4.45682461 1.08103991 -0.4631922
C  -1.93363567 4.07698055 -1.59908591
F  -0.08664671 2.77277 -1.15637061
C  -3.30737354 4.27163154 -1.64635627
F  -5.46950354 3.40528963 -1.29849346
F  -1.11503769 5.05209125 -1.98414856
F  -3.8094642 5.42334199 -2.07285446
