program: Gaussian 16
title: Title Card Required
version: ES64L-G16RevC.01
method: RwB97XD
basis: def2SVPP
operation: Freq
keyword: #N
keyword: Geom=AllCheck
keyword: Guess=TCheck
keyword: SCRF=Check
keyword: GenChk
keyword: RwB97XD/def2SVPP
keyword: Freq
converged: YES YES YES YES
title: Mulliken charges:
elementType: B C C C C C C C C C C C C F F F F F F F F F F C C C F C C C C H C H C H H H C C C C H C H C H H H C C C C F C F C F F F C C C C O O H H H H H H C H H H
charge: 0.169720 -0.041759 0.153856 0.163092 0.256154 0.212732 0.121569 -0.146908 0.168809 0.169817 0.228367 0.234544 0.112388 -0.174231 -0.180067 -0.177033 -0.178490 -0.190592 -0.176789 -0.168163 -0.165141 -0.177114 -0.176773 -0.011667 -0.018236 0.300617 -0.274819 0.046545 -0.155293 -0.173541 -0.100893 0.116175 -0.092122 0.126503 -0.091283 0.115490 0.113520 0.119412 0.030772 -0.162491 -0.159727 -0.101487 0.121167 -0.091976 0.129225 -0.088248 0.113887 0.113625 0.118012 -0.123729 0.176464 0.172233 0.225217 -0.185087 0.210022 -0.174562 0.130526 -0.177674 -0.178214 -0.171071 -0.304282 0.303809 -0.258854 -0.269748 -0.277737 -0.295655 0.136670 0.126281 0.146047 0.137311 0.143381 0.136465 -0.150219 0.143701 0.143445 0.154103
chargesum: -0.00000
title: Mulliken charges with hydrogens summed into heavy atoms:
elementType: B C C C C C C C C C C C C F F F F F F F F F F C C C F C C C C C C C C C C C C C C C C F C F C F F F C C C C O O C
charge: 0.169720 -0.041759 0.153856 0.163092 0.256154 0.212732 0.121569 -0.146908 0.168809 0.169817 0.228367 0.234544 0.112388 -0.174231 -0.180067 -0.177033 -0.178490 -0.190592 -0.176789 -0.168163 -0.165141 -0.177114 -0.176773 -0.011667 -0.018236 0.300617 -0.274819 0.046545 -0.039119 -0.047038 0.014597 0.021398 0.028129 0.030772 -0.041324 -0.030502 0.012401 0.021649 0.029764 -0.123729 0.176464 0.172233 0.225217 -0.185087 0.210022 -0.174562 0.130526 -0.177674 -0.178214 -0.171071 -0.304282 0.303809 0.150144 0.147408 -0.277737 -0.295655 0.291029
1716.lowfreq: -13.5398 -2.1225 -0.0010 -0.0006 -0.0002 1.3532 4.6439 15.2721 22.5732
frequency: -13.3786 15.2713 22.5618 25.1734 28.5514 33.2665 37.5879 39.1572 41.6292 46.1038 48.2145 55.3761 66.8056 76.1155 79.6940 87.9873 89.9252 98.4537 101.0864 112.4434 121.7748 123.2108 124.8563 133.1197 142.7562 145.6748 151.8142 154.8742 164.3580 167.1937 168.9419 176.6509 179.7504 181.4014 191.9016 205.1778 215.9506 232.7934 238.4345 244.5138 245.5743 251.4190 262.7701 272.3930 274.5291 275.7290 276.6035 279.6203 282.1286 284.1624 288.5727 291.6613 303.9786 318.4592 322.4918 331.9216 332.1666 345.9944 351.0984 355.5577 363.4901 368.9867 377.2249 400.8730 413.0210 422.4141 423.4891 425.2930 426.3124 433.6244 444.6858 451.5696 452.9203 454.4127 465.8383 480.4254 482.6740 501.3202 504.8881 509.3617 530.1102 541.1270 565.8688 587.7346 589.7034 591.8183 596.4761 604.0189 608.4130 621.5649 630.6299 637.1056 647.2741 652.3697 672.4574 673.5094 677.4642 683.4304 696.9439 700.7824 706.6649 724.8243 729.5742 744.0031 758.1894 773.2157 780.2181 786.9326 792.4531 805.7260 806.8411 812.3739 816.9456 862.3875 879.6634 881.0312 887.3140 911.5031 970.5322 972.4504 979.5726 1001.6545 1013.1741 1016.6814 1017.4961 1022.0784 1022.6652 1024.3065 1028.8963 1034.1165 1042.7122 1049.6112 1052.3008 1054.8118 1057.4686 1062.4508 1065.5608 1095.2028 1116.7982 1118.8261 1153.4413 1174.6144 1177.4768 1177.9969 1188.6654 1189.4017 1197.0174 1198.7325 1201.8401 1203.3093 1204.4697 1206.6024 1218.6110 1222.9306 1243.5683 1252.9619 1333.5965 1334.3972 1337.6843 1338.4555 1342.7709 1354.8132 1356.0870 1362.4209 1363.3905 1372.3775 1374.1653 1376.8304 1399.9862 1406.0725 1425.7225 1451.9547 1466.3693 1473.5430 1476.6363 1479.2788 1480.5918 1484.1754 1488.3174 1489.8087 1498.6267 1500.4974 1502.5909 1542.9081 1543.5147 1554.9821 1561.9468 1562.5327 1596.7854 1597.9050 1604.0095 1668.9490 1669.9280 1694.3988 1700.5829 1708.2193 1710.8907 1715.3474 1725.5156 1728.8846 1736.4255 1841.7336 1917.6936 3044.4825 3056.9585 3058.6464 3136.2455 3140.5403 3155.4721 3156.8863 3196.0727 3199.4980 3202.5474 3206.3500 3208.4529 3212.1033 3215.7556 3220.1206 3222.2969 3226.2341 3230.5700 3257.1237
redmass: 7.8951 8.7422 9.2856 11.4806 10.8345 8.4783 7.3305 8.9681 7.5590 6.4698 10.3492 8.2537 6.6706 5.9451 5.5831 6.3510 6.1427 5.3249 5.7109 10.9130 9.2957 14.3838 5.9486 15.3303 13.6180 10.7855 9.0805 8.8862 14.6460 12.8153 4.1859 1.6588 8.4244 7.0339 5.7788 4.4563 3.5232 4.4661 13.1529 7.4995 12.0580 11.8579 1.2010 2.6557 17.4304 5.4242 18.3940 17.4868 15.5995 16.4661 6.6779 17.3411 1.2709 15.9609 17.3839 17.5981 2.3906 16.0985 3.0846 15.4153 9.7034 4.2153 11.8824 12.7009 11.8787 11.9257 7.2368 7.6195 3.5056 3.6923 5.3568 15.2021 15.4529 15.6160 3.9783 14.9473 14.9170 9.9042 8.0157 4.3668 10.2733 5.4852 4.8581 16.6092 16.9416 16.8371 12.2460 12.2751 12.5074 6.0970 6.3864 6.1713 12.9343 13.1043 4.6764 10.8081 12.1259 11.6604 9.4786 6.0265 11.0736 1.7283 1.6259 11.9304 6.1418 5.0860 6.5961 9.0722 2.1388 10.5336 4.5439 3.1919 6.8580 4.9808 8.7700 1.3068 1.2514 3.2186 1.3864 1.4017 1.4217 2.1955 11.2035 9.8201 1.5791 4.5700 10.2261 4.9956 1.3987 1.4659 1.3407 1.3730 10.9631 10.9832 2.7169 2.3262 3.4904 2.7489 1.5557 1.5251 13.4234 2.5138 1.1705 1.0891 1.7197 3.7266 3.2146 1.7283 7.0493 5.0652 2.6434 1.1643 12.4252 2.2668 3.9441 2.6697 2.4408 11.7897 11.4767 11.9673 1.6838 3.4175 9.4712 3.7893 11.4548 6.4045 6.3426 3.0995 3.5941 1.3402 1.2604 12.3710 10.0673 1.0949 1.0865 1.0821 5.8205 1.1647 1.0511 1.1138 2.3993 2.4211 1.1382 2.6912 6.8657 11.9534 10.1306 3.0614 12.4308 12.3758 12.4415 6.1050 6.0216 6.0789 6.2523 12.0483 12.0555 12.0348 12.0460 12.0404 12.0333 11.9326 11.9400 1.0375 1.0400 1.0331 1.1057 1.1047 1.1096 1.1053 1.1023 1.0867 1.0868 1.1081 1.0901 1.0911 1.0941 1.0958 1.0970 1.1003 1.0969 1.0936
irintensity: 0.4165 0.1326 1.8948 0.2902 0.1716 0.2628 0.2912 0.6961 0.2680 2.8538 3.1450 0.0943 0.1020 2.0182 1.0481 0.7681 0.3504 0.6055 1.4197 0.2481 0.1984 0.0512 0.1600 0.3450 1.1409 0.5319 0.2898 0.7346 0.4595 0.2264 0.1229 1.1907 0.6190 0.6266 0.6692 0.6357 1.0925 7.0736 4.5544 5.2290 4.2571 11.6402 1.7986 0.7361 0.2988 1.5877 0.1774 0.3941 0.6050 0.3197 7.6821 0.7670 0.3740 2.2891 3.2123 1.7210 4.9091 5.7978 9.3188 20.0092 1.2629 15.1499 20.6868 0.8942 3.9080 0.6887 0.2133 0.0401 0.6055 0.4336 3.9943 2.8800 1.1305 1.0170 0.9056 8.1127 5.3461 31.5966 18.6594 23.6093 51.4275 14.8628 6.0203 4.3292 1.6732 0.5098 0.3106 0.6008 0.4513 70.1953 0.4176 15.6059 66.7892 55.4116 4.4016 1.1562 0.3753 0.1574 29.9712 12.2820 43.9948 96.9487 17.4286 97.8903 1.6307 12.8086 90.0230 8.8649 80.6242 43.0084 3.0374 16.0119 19.2729 91.8485 6.0590 3.6299 4.3879 73.6370 27.3170 1.2606 7.1207 48.4180 152.4958 29.7702 17.8918 4.5057 350.7456 0.1708 3.3037 6.1465 1.8999 7.4361 108.2154 302.1544 48.9311 4.7169 20.0616 2.1708 14.0292 1.7106 40.3735 87.7733 11.1299 0.6026 36.5765 103.0958 50.6470 14.9802 36.4153 186.7556 12.7099 3.1981 570.0604 42.6074 11.4774 49.3083 27.1402 4.9945 5.4570 9.4924 2.0145 305.2587 47.3749 106.3653 145.1247 162.8014 216.9115 6.8775 107.5343 39.8359 24.3207 194.7257 98.0374 0.5653 9.0126 29.3593 38.0598 21.6235 21.7896 18.8918 8.9726 13.3201 100.2457 64.6197 353.8707 546.5646 1188.7057 62.9258 203.9825 194.3110 202.6538 3.6741 1.1542 0.6058 3.4616 5.1674 6.2782 4.3591 251.9659 134.7015 74.2901 350.3926 10.3431 17.7584 31.5421 33.1224 6.0768 46.5356 23.5142 10.7244 3.3742 2.9618 0.9728 7.3578 10.4105 10.9454 23.2407 19.2205 8.2483 18.7195 18.0827 1.9146
temp: 298.150 k
press: 1.00000 atm
elementType: 5 6 6 6 6 6 6 6 6 6 6 6 6 9 9 9 9 9 9 9 9 9 9 6 6 6 9 6 6 6 6 1 6 1 6 1 1 1 6 6 6 6 1 6 1 6 1 1 1 6 6 6 6 9 6 9 6 9 9 9 6 6 6 6 8 8 1 1 1 1 1 1 6 1 1 1
symmnumber: 1
zpe: 1317809.5 jmol-1
zpe.correction: 0.501927 hartree
zpe.thermalcorrener: 0.552057 hartree
zpe.thermalcorrenthalpy: 0.553001 hartree
zpe.thermalcorrgfe: 0.417071 hartree
zpe.sumelectzpe: -3228.229909 hartree
zpe.sumelectthermal: -3228.179779 hartree
zpe.sumelectthermalent: -3228.178835 hartree
zpe.sumelectthermalfe: -3228.314766 hartree
dipole: 3.0220 0.7850 1.7839
dipole: 3.5960
quadrupole: -299.9281 -315.0231 -314.0799
quadrupole: 2.6279 -6.8559 -4.6791
quadrupole: 9.7489 -5.3460 -4.4029 2.6279 -6.8559 -4.6791
hfenergy: -3228.7318361 hartree
pointgroup: C01 [X(C38H19B1F16O2)]
dipole: 1.1889337 0.3088504 0.7018517 debye
polarizability: 527.018251|-56.7195716|622.5363193|-64.1121205|-63.2032881|424.3270153 unknown
InChI: InChI=1S/C20H19FO2.C18BF15/c1-19(2,18(22)23-3)20(21)16(14-10-6-4-7-11-14)17(20)15-12-8-5-9-13-15;20-4-1(5(21)11(27)16(32)10(4)26)19(2-6(22)12(28)17(33)13(29)7(2)23)3-8(24)14(30)18(34)15(31)9(3)25/h4-13H,1-3H3;
charge 0 multiplicity 1
76 atoms
B  -0.82457205 -0.7581599 -0.80413929
C  0.2114592 0.21864979 -1.47084041
C  -0.0340158 1.59689083 -1.58748085
C  1.45876282 -0.20951638 -1.94846721
C  0.85142034 2.47716223 -2.19279235
C  2.38219251 0.65366624 -2.53115411
C  2.07826061 2.00404055 -2.64786627
C  -0.44340924 -2.28930842 -0.57338588
C  -0.03586991 -2.91098368 0.59850875
C  -0.53366277 -3.1014997 -1.7012144
C  0.31776601 -4.25826105 0.64413598
C  -0.20312257 -4.45011291 -1.69695784
C  0.2344331 -5.03067608 -0.5082876
F  0.03671979 -2.23740056 1.73827179
F  0.7302642 -4.80191093 1.78015025
F  0.56306858 -6.31036318 -0.47703626
F  -0.29186875 -5.17820808 -2.79905841
F  -0.92601262 -2.55333607 -2.85485371
F  -1.14008126 2.13339507 -1.09261122
F  0.56591019 3.76315223 -2.29155961
F  2.9519595 2.83641617 -3.17512877
F  3.55725119 0.20292463 -2.94311727
F  1.83136903 -1.4788611 -1.87005558
C  1.67808025 1.72125517 1.35018492
C  2.06064541 0.47006566 1.54492349
C  0.74536089 0.84908294 2.05418379
F  -0.38406547 0.38130047 1.28811334
C  3.00473846 -0.59878231 1.26577881
C  2.91736698 -1.84037009 1.91295811
C  3.99189493 -0.41297383 0.28419556
C  3.77909336 -2.87797103 1.56643127
H  2.15737681 -1.99919422 2.67796143
C  4.85110097 -1.45099478 -0.06224593
H  4.0713593 0.5467303 -0.23128979
C  4.74384227 -2.68828141 0.5754401
H  3.68876227 -3.84479045 2.06876395
H  5.60155025 -1.29534526 -0.84160532
H  5.41330515 -3.50739364 0.2984386
C  1.89772396 3.05602796 0.83094213
C  3.10921109 3.3962556 0.20678524
C  0.88505145 4.02024373 0.94519067
C  3.29728633 4.67502804 -0.30720581
H  3.90814538 2.65482333 0.12692272
C  1.08332458 5.30222639 0.43735002
H  -0.04831844 3.75280441 1.44761814
C  2.28392877 5.63020849 -0.19264231
H  4.23945803 4.92951633 -0.79975453
H  0.2902419 6.04944496 0.52764341
H  2.43304815 6.63488634 -0.59812745
C  -2.36501956 -0.4201764 -0.68850308
C  -3.07063687 0.17884785 -1.73448256
C  -3.11808547 -0.7937304 0.42739282
C  -4.43652207 0.43229551 -1.67364513
F  -2.44494782 0.51515382 -2.85777462
C  -4.48286944 -0.54218672 0.52798877
F  -2.544256 -1.40405457 1.45423643
C  -5.14401108 0.07530818 -0.52909841
F  -5.06628386 1.00133631 -2.68928018
F  -5.15606549 -0.89301089 1.61415603
F  -6.4393538 0.31240524 -0.45100147
C  0.2525676 0.9896545 3.5026539
C  -1.13123441 1.64405519 3.3892552
C  0.19062897 -0.36960443 4.2058433
C  1.18184871 1.94105297 4.26748491
O  -1.30746059 2.7870612 3.03895254
O  -2.12734434 0.82309089 3.6904316
H  1.20929466 -0.78325115 4.29221449
H  -0.21854815 -0.26042385 5.22369543
H  -0.43726273 -1.08120867 3.65441177
H  2.20650538 1.53321632 4.28914548
H  1.2096691 2.93702448 3.79858141
H  0.83654016 2.05447408 5.30892921
C  -3.44662134 1.31008646 3.49228209
H  -3.65934545 2.1482897 4.17462215
H  -3.57525738 1.65008383 2.45174993
H  -4.11527086 0.46602174 3.70176566
