program: Gaussian 16
title: Title
version: ES64L-G16RevC.01
method: RwB97XD
basis: def2SVPP
operation: Freq
keyword: #N
keyword: Geom=AllCheck
keyword: Guess=TCheck
keyword: SCRF=Check
keyword: GenChk
keyword: RwB97XD/def2SVPP
keyword: Freq
converged: YES YES NO YES
title: Mulliken charges:
elementType: B F C C C C C O O C H H H C H H H Si C H H H C H H H C H H H C H H H C C C C H C H C H H H C C C C H C H C H H H C C C C O O H H H H H H C H H H C C C C F C F C F F F C C C C F C F C F F F C C C C F C F C F F F
charge: 0.275039 -0.252605 -0.015782 0.001189 0.028575 -0.310278 0.428660 -0.366026 -0.233957 -0.291195 0.155904 0.147828 0.180773 -0.260497 0.149417 0.168067 0.142698 0.767057 -0.638641 0.183724 0.207585 0.178998 -0.669709 0.252544 0.165947 0.198416 -0.594456 0.173814 0.172555 0.186293 -0.191946 0.188570 0.188206 0.185714 0.060702 -0.159427 -0.183212 -0.096608 0.110846 -0.102262 0.121744 -0.090617 0.114208 0.111250 0.119360 0.045611 -0.201170 -0.172666 -0.087222 0.142823 -0.101519 0.106341 -0.108024 0.113402 0.117453 0.120806 -0.267050 0.251573 -0.277417 -0.260759 -0.254205 -0.321872 0.139564 0.136608 0.139643 0.146829 0.145821 0.141687 -0.142997 0.146506 0.146476 0.155339 -0.158186 0.149818 0.131771 0.231484 -0.203115 0.212922 -0.201644 0.094569 -0.192520 -0.194409 -0.191425 -0.169356 0.111100 0.143775 0.237083 -0.202164 0.208103 -0.202668 0.100724 -0.191377 -0.190952 -0.188656 -0.080929 0.108276 0.128079 0.218307 -0.200608 0.228884 -0.192215 0.107822 -0.189930 -0.186952 -0.185658
chargesum: -0.00000
title: Mulliken charges with hydrogens summed into heavy atoms:
elementType: B F C C C C C O O C C Si C C C C C C C C C C C C C C C C C C C C O O C C C C C F C F C F F F C C C C F C F C F F F C C C C F C F C F F F
charge: 0.275039 -0.252605 -0.015782 0.001189 0.028575 -0.310278 0.428660 -0.366026 -0.233957 0.193310 0.199685 0.767057 -0.068334 -0.052802 -0.061795 0.370544 0.060702 -0.048581 -0.061468 0.017600 0.008988 0.028742 0.045611 -0.058347 -0.066324 0.026180 0.015934 0.012781 -0.267050 0.251573 0.138397 0.173578 -0.254205 -0.321872 0.305324 -0.158186 0.149818 0.131771 0.231484 -0.203115 0.212922 -0.201644 0.094569 -0.192520 -0.194409 -0.191425 -0.169356 0.111100 0.143775 0.237083 -0.202164 0.208103 -0.202668 0.100724 -0.191377 -0.190952 -0.188656 -0.080929 0.108276 0.128079 0.218307 -0.200608 0.228884 -0.192215 0.107822 -0.189930 -0.186952 -0.185658
1716.lowfreq: -0.0007 0.0004 0.0007 2.3461 3.2644 5.8807 11.6377 15.0763 16.7645
redmass: 9.4933 7.1960 12.4699 15.1543 7.2867 13.6054 7.0552 9.8347 5.9849 10.0268 9.6551 6.6824 8.1972 4.6301 7.0591 4.9890 4.2675 5.4688 4.2964 4.9705 4.4401 5.2142 4.8430 4.8214 8.3049 3.6379 5.2778 6.8670 15.4767 6.5503 6.5406 12.0634 15.2996 15.8363 14.8038 4.2831 3.4265 17.2646 12.9512 3.0211 1.6701 5.9269 1.4498 2.1594 2.2340 2.1444 3.1190 4.9113 3.6753 2.0183 4.4051 5.4821 2.1871 2.0127 4.4045 1.5735 2.3848 2.2609 6.2146 2.1973 4.1992 2.8471 2.5997 16.2236 17.6369 10.7883 2.7168 18.3222 3.2755 16.9172 13.9074 1.6755 2.1277 17.0438 1.4771 16.4728 17.5749 8.8520 1.4896 2.5441 2.4428 2.9324 16.9601 16.9972 16.8497 2.1575 2.9685 3.0301 12.7870 2.9762 12.6939 12.6220 4.2351 4.2591 3.5247 10.4991 4.2219 15.6463 15.7739 15.7230 13.5850 3.7346 15.5501 15.2708 3.2522 3.9250 11.6872 6.0655 4.0004 5.2789 15.9928 16.5305 13.2384 16.7376 5.4665 12.2788 12.2360 6.2508 12.6212 6.4047 3.6859 3.8261 12.4486 12.1849 12.0665 4.4086 11.5495 12.2092 1.1994 1.6471 4.2171 9.1085 1.6162 1.8219 1.8007 11.0488 5.7520 6.5976 12.7186 3.4945 12.5269 1.6813 12.2526 5.3309 1.9510 3.6201 1.9848 2.1511 12.2401 1.6779 2.9539 1.2902 1.2798 1.6885 1.7351 3.1915 2.7628 11.9632 1.4551 1.6283 1.4319 9.4318 1.4578 2.1489 11.8900 2.9178 13.4081 3.3648 1.9106 6.3675 2.1505 12.5720 3.5625 3.8573 1.8108 1.6336 1.3351 1.3439 1.5401 2.2398 1.8538 3.0394 1.4635 1.5952 13.3127 13.1456 12.7806 3.3763 2.3267 1.5238 1.6319 4.8995 5.2653 1.3030 1.3068 1.6301 1.4353 2.0259 2.7527 1.2174 2.2218 2.3399 2.9724 2.4944 2.6113 4.0844 1.2884 1.2825 1.2502 11.5789 10.8934 11.4455 7.7735 1.7873 11.2106 3.7472 11.3400 1.7354 3.8933 4.5719 3.7951 1.2751 1.2428 1.3183 1.3643 1.1155 1.1662 1.3440 2.3833 1.2952 2.2667 1.6934 1.2015 3.1504 1.1811 1.0431 1.0581 1.0505 1.0486 1.0562 1.0802 1.0804 1.1100 1.4206 1.2710 1.4950 1.6134 1.1047 1.0843 1.3632 12.0836 1.6995 2.4960 9.6983 10.1697 2.7761 12.4318 12.4116 12.3885 6.1326 6.0641 6.1172 6.2924 11.0625 10.1981 11.5909 12.0131 12.0350 12.0375 12.0240 12.0298 11.9453 1.0374 1.0368 1.0410 1.0409 1.0372 1.0321 1.0377 1.0472 1.0309 1.1029 1.1052 1.1025 1.1045 1.1029 1.1060 1.1046 1.1089 1.1052 1.1039 1.0952 1.1006 1.1035 1.1092 1.1119 1.0971 1.0872 1.0884 1.0922 1.0935 1.1037 1.0972 1.1016 1.1026 1.0945 1.0938 1.0956 1.0915
irintensity: 0.6315 0.7168 0.2188 0.1841 1.7564 0.9351 0.6838 0.6777 2.8231 0.6916 1.9766 0.4434 0.1446 1.5692 1.2454 1.4756 0.7076 1.7094 0.7779 2.7882 1.1072 1.8845 1.1773 0.2112 0.4201 0.3015 1.5979 0.4449 0.7328 2.1913 1.1142 0.3578 0.9847 0.1644 0.1887 1.0780 1.7897 0.1405 0.6190 1.9105 0.2030 1.3971 0.4867 0.4743 0.2130 0.7371 0.3128 3.4339 2.1832 1.5548 6.1630 3.6463 4.0768 5.2378 3.4298 4.0240 4.4139 1.9732 4.9598 1.6323 1.7793 5.9952 5.8796 0.3565 0.1875 0.7517 7.0399 0.2549 1.3108 0.0408 0.5970 2.2813 3.2265 0.3068 2.0857 1.6599 1.8767 6.7515 8.4872 26.7771 9.4061 13.1806 6.8967 8.1637 2.2657 12.8866 11.3948 38.9532 0.2842 1.9133 0.1462 0.1866 1.6631 0.2089 1.8516 3.9913 11.6165 0.1998 0.2057 0.5754 1.5331 0.9528 5.0018 3.3535 4.0626 0.9563 0.3197 94.3455 5.3976 4.6703 2.6481 3.2707 0.5803 0.9068 9.3032 0.3115 1.2356 0.0997 45.0483 0.4309 31.8831 19.6741 69.4910 0.2858 0.1304 3.9803 1.0346 6.4532 0.7687 1.8618 3.4949 81.7823 12.2131 89.5849 3.7016 94.7933 1.3425 23.7319 25.5618 8.4412 49.9470 28.2515 66.7334 82.2009 66.4755 24.2916 15.4174 2.6900 57.5606 327.2766 51.4496 14.5911 35.5701 179.8179 144.3023 89.6985 10.9574 77.1553 4.8814 19.5786 10.5779 145.7838 17.6326 19.4824 173.2367 14.8551 104.0475 14.5226 10.5010 186.9642 73.6842 354.3253 5.7165 13.3937 5.9148 8.9082 3.3618 0.4288 1.6462 2.7891 6.8275 26.5988 21.5104 4.2432 99.8721 392.0070 532.6087 43.7113 2.6259 1.9032 0.3631 7.5143 2.5957 2.2658 2.3783 8.1075 10.0489 21.0698 56.4164 2.9057 28.3707 26.2124 5.7943 143.7270 30.6919 34.8256 67.1947 81.7170 26.7996 46.7437 36.1032 80.0807 12.2092 4.4677 18.4015 275.7931 5.5577 12.0994 26.2204 1.3577 1.7418 13.4327 25.2733 76.6534 41.8016 10.1684 26.4490 92.3887 9.3820 28.7255 36.5304 8.5996 11.5079 14.5987 9.3023 5.7376 18.7454 8.5291 12.7233 25.6969 13.6710 0.2954 16.6007 23.4619 19.9355 8.2264 19.9723 23.9879 41.1862 67.1459 451.8291 288.7387 105.1028 486.0112 1175.6735 18.0604 231.9869 299.8619 48.3585 4.5514 2.5895 1.0526 0.3174 304.1353 574.8496 199.5273 3.7706 90.1579 74.3099 52.1567 439.4216 11.0659 0.4066 17.2966 2.9069 15.6291 10.4050 42.5616 15.8061 25.6009 17.5281 0.9891 17.5895 0.6169 5.5503 14.0913 9.2407 20.2252 12.2962 28.5202 2.2566 3.8540 31.5602 7.4601 9.9452 1.0248 1.7372 1.0917 7.2937 9.5656 9.8062 5.6547 25.5802 3.0132 6.9709 9.1750 10.6798 1.0551 0.6647
temp: 298.150 k
press: 1.00000 atm
elementType: 5 9 6 6 6 6 6 8 8 6 1 1 1 6 1 1 1 14 6 1 1 1 6 1 1 1 6 1 1 1 6 1 1 1 6 6 6 6 1 6 1 6 1 1 1 6 6 6 6 1 6 1 6 1 1 1 6 6 6 6 8 8 1 1 1 1 1 1 6 1 1 1 6 6 6 6 9 6 9 6 9 9 9 6 6 6 6 9 6 9 6 9 9 9 6 6 6 6 9 6 9 6 9 9 9
symmnumber: 1
zpe: 1985427.3 jmol-1
zpe.correction: 0.756209 hartree
zpe.thermalcorrener: 0.823199 hartree
zpe.thermalcorrenthalpy: 0.824143 hartree
zpe.thermalcorrgfe: 0.652557 hartree
zpe.sumelectzpe: -3983.125191 hartree
zpe.sumelectthermal: -3983.058202 hartree
zpe.sumelectthermalent: -3983.057258 hartree
zpe.sumelectthermalfe: -3983.228844 hartree
dipole: -24.7313 -5.2045 6.1415
dipole: 26.0085
quadrupole: -433.9353 -364.6081 -387.2850
quadrupole: 18.4169 -37.4452 -2.9649
quadrupole: -38.6592 30.6680 7.9911 18.4169 -37.4452 -2.9649
hfenergy: -3983.8814005 hartree
pointgroup: C01 [X(C46H37B1F16O4Si1)]
dipole: -9.7300234 -2.0476136 2.4162696 debye
polarizability: 669.956023|0.1000804|754.5905054|-20.6927036|32.0367863|559.9870704 unknown
InChI: InChI=1S/C28H37O4Si.C18BF16/c1-26(2,24(29)30-5)28(27(3,4)25(31-6)32-33(7,8)9)22(20-16-12-10-13-17-20)23(28)21-18-14-11-15-19-21;20-4-1(5(21)11(27)16(32)10(4)26)19(35,2-6(22)12(28)17(33)13(29)7(2)23)3-8(24)14(30)18(34)15(31)9(3)25/h10-19H,1-9H3;
charge 0 multiplicity 1
105 atoms
B  3.0711202 0.11303848 0.37500193
F  2.18581478 0.00484383 1.50616011
C  -4.36021973 1.41088407 -0.05531541
C  -4.0627553 0.22357441 -0.51718179
C  -5.3232013 0.31147646 0.31097602
C  -5.2680398 -0.21512807 1.82841477
C  -4.22487175 -1.30844902 1.83978192
O  -3.00912703 -1.07402836 1.95827772
O  -4.63876818 -2.51908418 1.71289662
C  -4.78759758 0.90088138 2.77074569
H  -5.58252392 1.65558932 2.87163154
H  -4.57212903 0.50220623 3.77673613
H  -3.88289384 1.40131303 2.39743862
C  -6.5707369 -0.79368947 2.41093716
H  -7.3820428 -0.05566909 2.36926449
H  -6.89918997 -1.71252802 1.912772
H  -6.40908129 -1.04378447 3.47275477
Si -1.27817062 -0.64476107 2.14311771
C  -1.10736617 1.12503796 1.62033078
H  -1.64197473 1.81455417 2.29473735
H  -0.02939968 1.36639539 1.65398229
H  -1.45652976 1.28591008 0.58935441
C  -0.42557877 -1.88240206 1.06808171
H  0.65247302 -1.67708369 1.16129407
H  -0.61483196 -2.9169623 1.40047334
H  -0.70284319 -1.77801046 0.00577395
C  -1.0203916 -0.90692501 3.96477445
H  -1.669052 -0.24270621 4.56138677
H  -1.21627413 -1.95290364 4.25644696
H  0.03070821 -0.67315869 4.21311734
C  -3.70150073 -3.60800409 1.68693781
H  -2.98849933 -3.46188707 0.86227276
H  -3.17838368 -3.66631127 2.6525063
H  -4.30878332 -4.50505798 1.52204344
C  -4.06795438 2.83005509 0.03409067
C  -4.86116289 3.70030402 0.79858762
C  -2.9519672 3.35345976 -0.63842506
C  -4.54056159 5.05251662 0.89119225
H  -5.73337569 3.31425842 1.32946125
C  -2.62618436 4.70275407 -0.53993053
H  -2.32768949 2.69586299 -1.24286795
C  -3.42116142 5.55725758 0.2263782
H  -5.16817569 5.71698263 1.49121834
H  -1.74397857 5.082891 -1.06168585
H  -3.16806805 6.618125 0.30612217
C  -3.20880655 -0.66184944 -1.28755289
C  -3.53061786 -2.02355795 -1.41445759
C  -2.04309914 -0.1834666 -1.90722122
C  -2.68841398 -2.88915816 -2.10880481
H  -4.46165337 -2.38561282 -0.97366916
C  -1.20839591 -1.04836937 -2.60955031
H  -1.76892364 0.86860649 -1.82765575
C  -1.5208523 -2.40553168 -2.70320601
H  -2.94697435 -3.94851413 -2.18991107
H  -0.29743005 -0.66102358 -3.0714763
H  -0.8516506 -3.08459077 -3.23893016
C  -6.70217453 0.32220072 -0.42401066
C  -7.45340656 -1.00301507 -0.32795441
C  -7.59465294 1.46819929 0.07368537
C  -6.49100332 0.52066189 -1.94378513
O  -8.64049336 -1.1220886 -0.15762023
O  -6.64746588 -2.047684 -0.53490421
H  -7.16357395 2.4314706 -0.2415268
H  -8.60384922 1.38607671 -0.35896278
H  -7.70028029 1.48656947 1.16942221
H  -6.0034114 1.48874047 -2.14225507
H  -5.86817289 -0.27737248 -2.37749529
H  -7.46800015 0.52004454 -2.45606193
C  -7.23701978 -3.33957683 -0.51433181
H  -7.67983598 -3.54578262 0.47357452
H  -8.01708729 -3.42296514 -1.28681042
H  -6.42273489 -4.04771471 -0.71864437
C  4.64232629 -0.02948525 0.84260592
C  5.64333618 -0.10236578 -0.12346759
C  5.08100761 -0.13115449 2.15913414
C  6.99191434 -0.27316662 0.16828485
F  5.32263213 0.02277303 -1.41688357
C  6.42363663 -0.30768433 2.49914651
F  4.23162714 -0.05558011 3.18491994
C  7.38464026 -0.38163685 1.49885528
F  7.90167863 -0.33085466 -0.79900232
F  6.79158463 -0.4035026 3.7734697
F  8.66430688 -0.54710391 1.80842538
C  2.7483671 -1.18718099 -0.61101135
C  2.70851494 -2.45099475 -0.02229292
C  2.4551074 -1.17532828 -1.97196414
C  2.31938595 -3.61002895 -0.68921931
F  3.00256474 -2.59842012 1.27321265
C  2.06067024 -2.30782001 -2.68107283
F  2.50096628 -0.04638319 -2.68481912
C  1.98152955 -3.53423243 -2.03467314
F  2.25388253 -4.77414227 -0.05173603
F  1.72300686 -2.21842525 -3.96543436
F  1.57659088 -4.61270157 -2.69320783
C  2.72016446 1.57908004 -0.30041585
C  3.52368259 2.71574268 -0.27209986
C  1.46305306 1.77249664 -0.86969118
C  3.12936652 3.94856046 -0.79965375
F  4.74096963 2.69478373 0.27544597
C  1.03931836 2.9681706 -1.43247718
F  0.59517728 0.75744329 -0.92527276
C  1.87509615 4.07829687 -1.38087848
F  3.94015589 4.99884342 -0.73858162
F  -0.153975 3.06492414 -2.01782546
F  1.47782028 5.23793849 -1.88551626
