program: Gaussian 16
title: Title Card Required
version: ES64L-G16RevC.01
method: RwB97XD
basis: def2SVPP
operation: Freq
keyword: #N
keyword: Geom=AllCheck
keyword: Guess=TCheck
keyword: SCRF=Check
keyword: GenChk
keyword: RwB97XD/def2SVPP
keyword: Freq
converged: YES YES NO YES
title: Mulliken charges:
elementType: B C C C C C C C C C C C C F F F F F F F F F F C C C F C C C C H C H C H H H C C C C H C H C H H H C C C C F C F C F F F C C C C O O H H H H H H C H H H
charge: 0.165362 -0.040051 0.155516 0.158528 0.257784 0.227065 0.114823 -0.146504 0.166271 0.169589 0.229038 0.234758 0.114634 -0.173571 -0.179506 -0.176414 -0.177766 -0.190049 -0.175292 -0.167384 -0.164425 -0.175646 -0.175417 -0.024625 -0.025793 0.308976 -0.271976 0.047493 -0.158525 -0.166432 -0.103010 0.119754 -0.090890 0.118934 -0.090086 0.115680 0.113567 0.119304 0.037362 -0.167749 -0.157154 -0.097393 0.121882 -0.093919 0.127711 -0.087889 0.113268 0.113691 0.117725 -0.126211 0.178050 0.170303 0.225808 -0.184627 0.213906 -0.175964 0.129492 -0.177186 -0.178013 -0.170594 -0.310790 0.302994 -0.257872 -0.265443 -0.278917 -0.296443 0.133029 0.126949 0.145501 0.135938 0.141991 0.135946 -0.146992 0.141945 0.143964 0.151987
chargesum: -0.00000
title: Mulliken charges with hydrogens summed into heavy atoms:
elementType: B C C C C C C C C C C C C F F F F F F F F F F C C C F C C C C C C C C C C C C C C C C F C F C F F F C C C C O O C
charge: 0.165362 -0.040051 0.155516 0.158528 0.257784 0.227065 0.114823 -0.146504 0.166271 0.169589 0.229038 0.234758 0.114634 -0.173571 -0.179506 -0.176414 -0.177766 -0.190049 -0.175292 -0.167384 -0.164425 -0.175646 -0.175417 -0.024625 -0.025793 0.308976 -0.271976 0.047493 -0.038771 -0.047498 0.012671 0.022677 0.029218 0.037362 -0.045868 -0.029442 0.015875 0.019772 0.029835 -0.126211 0.178050 0.170303 0.225808 -0.184627 0.213906 -0.175964 0.129492 -0.177186 -0.178013 -0.170594 -0.310790 0.302994 0.147608 0.148433 -0.278917 -0.296443 0.290904
1716.lowfreq: -2.4338 -0.0005 -0.0002 0.0002 2.9154 5.1432 15.1303 18.9418 21.8403
frequency: 15.0956 18.7953 21.8137 25.2533 28.5521 34.0640 36.9533 41.6929 43.4425 47.1274 52.4236 58.5847 64.6329 73.1279 81.2123 86.3377 89.2712 96.0395 103.1387 109.0723 118.6082 120.3122 126.2776 131.2339 139.6196 149.2492 150.1142 154.1570 162.0382 165.2088 169.8567 179.3961 180.9614 191.4323 205.7277 207.5864 217.6087 236.0032 240.6233 243.9505 246.4278 250.3664 266.1515 272.7021 273.4788 274.5635 276.9956 280.2390 281.2355 284.2216 290.9363 291.3882 316.9471 317.8266 320.4445 329.3405 338.0418 344.5181 353.2328 357.9546 363.7258 367.6873 375.7462 399.2220 411.6286 421.3065 421.9824 424.2367 426.1382 432.4832 442.2579 451.4594 453.0181 454.2996 464.5284 480.2761 482.6508 502.3044 504.3779 511.7261 537.4647 542.8487 566.6402 587.8190 589.7000 591.7652 597.3329 605.3325 607.2469 625.0507 630.7395 638.9307 646.9372 651.4211 671.0261 673.2471 676.7842 682.8157 697.5222 701.9035 705.7216 720.2308 729.4461 743.6547 760.3378 777.0206 784.1073 789.3388 793.4054 805.6020 806.6637 812.6649 817.2755 868.0971 879.9647 880.3840 885.5434 919.6318 970.6884 972.0700 974.2646 1004.8357 1013.7300 1016.9759 1020.1254 1021.2586 1023.3731 1024.1676 1024.9287 1036.3486 1044.9868 1047.1512 1053.8057 1055.9904 1057.4417 1062.0189 1065.6703 1094.3783 1115.6880 1116.5253 1153.5944 1174.9929 1177.3875 1178.1173 1190.3695 1191.6566 1197.7877 1198.9995 1201.8551 1204.3281 1205.1987 1205.4811 1221.0725 1224.2379 1242.6512 1254.3131 1332.6549 1334.6435 1337.9501 1339.3914 1342.5627 1354.6884 1356.4832 1362.3586 1364.1590 1373.5057 1375.6200 1376.4538 1399.0283 1406.3722 1426.6380 1450.3635 1466.7505 1476.1995 1478.2342 1481.0283 1482.9924 1485.6459 1490.2388 1492.7563 1499.2638 1500.5811 1507.3564 1542.4710 1543.5842 1554.8992 1562.1168 1562.6117 1597.2061 1597.5819 1603.9009 1669.1222 1670.2243 1694.4724 1700.7852 1708.0735 1710.7403 1715.0771 1725.9570 1729.0549 1736.3360 1841.7140 1918.0803 3045.3469 3055.3032 3060.2290 3135.8345 3138.8683 3157.8584 3159.0949 3195.5924 3198.8880 3201.9346 3206.0282 3206.5073 3210.7824 3211.9621 3217.7970 3219.7162 3225.1062 3228.7080 3259.4215
redmass: 7.4586 9.6163 11.0253 13.1774 10.6135 9.9325 8.6002 10.4399 8.4500 5.3329 9.5568 6.5419 6.3419 4.2455 5.9052 8.0900 8.9723 6.5314 5.2658 9.2873 10.6578 13.6608 5.7862 14.7951 13.1402 9.2964 11.2644 12.5710 13.5584 14.1526 14.1676 15.5372 8.7692 5.2223 3.7439 1.4118 3.4659 10.8072 3.0292 7.2494 10.9687 11.4081 1.2076 3.0833 4.4804 16.0195 17.8732 16.9519 15.8352 16.5214 10.3014 7.5816 7.4070 2.0894 17.7998 17.9311 1.8321 9.1347 14.9809 2.6138 11.4978 4.1292 9.3623 12.6451 12.3779 2.8865 12.4249 10.5031 8.0271 3.6418 5.4318 15.6574 15.2258 15.3287 4.0074 15.0494 14.9019 6.8735 12.3128 4.2648 6.8544 7.6903 4.7198 16.6082 16.8813 16.8334 12.2512 12.2728 12.5254 6.0662 6.3825 5.9945 13.0065 13.0515 4.4169 12.1831 12.1554 11.5974 11.3942 5.7879 9.8090 1.6759 1.6818 12.1655 6.6462 5.7294 10.1507 4.4987 2.1661 10.9540 5.2237 2.6964 8.9654 4.5405 1.3245 8.5459 1.2440 3.3510 1.4001 1.4215 1.4054 2.2604 11.3653 12.3136 2.8114 1.8154 5.5777 1.7485 4.5080 1.4651 1.3335 1.3593 12.5660 9.0862 2.8450 2.3041 3.5209 2.7705 1.5454 1.5178 13.4006 2.5875 1.1396 1.1023 11.4313 1.2950 1.4581 4.3336 6.9639 8.9788 1.8634 1.3521 12.4092 2.2305 3.9932 2.6341 2.6379 11.7155 11.7952 11.6714 1.6085 3.2782 7.9056 3.7377 12.5122 5.6838 7.3927 3.4287 3.7313 1.3177 1.2603 12.4004 11.3170 1.0666 1.1263 5.0775 1.1623 1.1001 1.0520 1.1183 2.4170 2.4262 1.1139 2.3349 11.1749 11.9713 8.8963 3.2026 12.4347 12.3895 12.4550 6.1248 6.0483 6.0738 6.2571 12.0590 12.0613 12.0355 12.0482 12.0411 12.0332 11.9310 11.9414 1.0376 1.0404 1.0328 1.1057 1.1047 1.1097 1.1050 1.1015 1.0866 1.0869 1.0904 1.1079 1.0919 1.0931 1.0971 1.0954 1.1006 1.0986 1.0933
irintensity: 0.2824 0.4182 1.5590 0.2257 0.0485 0.2455 0.2257 0.3523 2.1667 0.0635 1.3661 0.3391 0.8521 0.2362 1.5697 1.5736 0.5654 1.0251 1.1757 0.1500 0.1438 0.1338 0.1589 0.3471 0.9215 0.3464 0.4709 0.0750 0.1686 0.4977 0.0983 0.3310 1.0258 0.9067 1.2096 0.6789 2.0348 4.1665 8.4554 2.4273 6.1224 11.7719 1.0220 1.4651 1.5104 0.0233 0.2049 0.6681 0.4414 0.0730 3.0155 4.5921 1.5819 0.7026 3.3560 1.5376 6.4855 6.1844 14.5231 10.0813 1.5369 8.8857 14.1859 1.4539 3.6281 0.3304 1.0567 0.1004 0.1157 0.5310 3.3188 1.8077 1.0467 1.3753 0.8497 7.6984 6.4576 33.1783 3.0285 24.7777 17.1548 32.9446 4.3098 4.5867 1.7893 0.3505 0.3956 0.8126 0.4107 47.4666 1.6938 23.1336 65.4042 50.1814 4.4111 0.4055 0.4988 0.2580 26.5162 22.1521 34.4808 60.4560 58.9806 81.3520 0.9124 15.0451 67.6773 7.3401 90.1156 44.7354 2.9238 8.2016 24.8572 82.3325 2.0213 7.9348 4.2493 83.5567 9.3706 20.0314 7.7676 58.9603 125.7033 61.6466 47.9716 42.1914 276.9307 3.7924 23.6761 6.2509 2.8948 2.5405 103.3865 265.8602 83.0138 4.9707 18.6922 2.7270 13.9916 1.8317 35.1332 81.4598 6.5530 3.5965 119.1936 2.1887 22.5182 38.7007 85.0320 141.1282 40.9955 10.5547 553.4795 50.0064 10.4058 57.6787 32.9944 3.8909 5.5986 12.3983 0.8289 226.4440 58.4236 202.7476 111.9262 118.4893 274.3208 4.3051 110.7788 32.0475 23.1546 221.7411 109.3277 2.2453 7.4787 20.8062 42.7536 25.4232 19.0965 19.7971 3.9053 20.2336 97.1443 9.7498 405.3036 575.6265 1126.8369 126.2727 227.1557 165.8304 206.0289 3.3716 1.3067 0.5011 3.2338 6.2483 5.8540 5.0854 262.8792 131.4052 73.3616 350.7760 10.6296 17.4271 28.1737 36.9617 0.9705 50.7115 24.5904 10.9346 3.2462 4.2803 2.1159 16.5670 6.1195 9.8414 4.6556 32.1098 3.7408 25.9439 16.8341 1.4881
temp: 298.150 k
press: 1.00000 atm
elementType: 5 6 6 6 6 6 6 6 6 6 6 6 6 9 9 9 9 9 9 9 9 9 9 6 6 6 9 6 6 6 6 1 6 1 6 1 1 1 6 6 6 6 1 6 1 6 1 1 1 6 6 6 6 9 6 9 6 9 9 9 6 6 6 6 8 8 1 1 1 1 1 1 6 1 1 1
symmnumber: 1
zpe: 1318450.2 jmol-1
zpe.correction: 0.502171 hartree
zpe.thermalcorrener: 0.553133 hartree
zpe.thermalcorrenthalpy: 0.554078 hartree
zpe.thermalcorrgfe: 0.415168 hartree
zpe.sumelectzpe: -3228.229803 hartree
zpe.sumelectthermal: -3228.178841 hartree
zpe.sumelectthermalent: -3228.177897 hartree
zpe.sumelectthermalfe: -3228.316806 hartree
dipole: 3.0981 0.6590 1.3340
dipole: 3.4369
quadrupole: -299.1908 -314.2411 -315.0725
quadrupole: 4.2825 -7.1207 -4.8810
quadrupole: 10.3106 -4.7396 -5.5710 4.2825 -7.1207 -4.8810
hfenergy: -3228.7319742 hartree
pointgroup: C01 [X(C38H19B1F16O2)]
dipole: 1.2189041 0.2592584 0.5248312 debye
polarizability: 531.4001622|-57.1499883|629.0777348|-65.5987128|-58.9656893|417.5541249 unknown
InChI: InChI=1S/C20H19FO2.C18BF15/c1-19(2,18(22)23-3)20(21)16(14-10-6-4-7-11-14)17(20)15-12-8-5-9-13-15;20-4-1(5(21)11(27)16(32)10(4)26)19(2-6(22)12(28)17(33)13(29)7(2)23)3-8(24)14(30)18(34)15(31)9(3)25/h4-13H,1-3H3;
charge 0 multiplicity 1
76 atoms
B  -0.86241654 -0.81697043 -0.85630814
C  0.22278553 0.13319538 -1.47126623
C  0.01624189 1.51858494 -1.58866577
C  1.47792458 -0.32491865 -1.90062943
C  0.94900073 2.37924243 -2.14772672
C  2.44204689 0.51632741 -2.44814342
C  2.17898863 1.87562089 -2.56027579
C  -0.52764512 -2.35148794 -0.59192725
C  -0.15411367 -2.9491134 0.60326131
C  -0.60897949 -3.18780705 -1.70193909
C  0.1765308 -4.29982634 0.68948888
C  -0.30199958 -4.54154991 -1.65709608
C  0.10260761 -5.09889853 -0.44579379
F  -0.09016954 -2.24320411 1.72489736
F  0.56323349 -4.82041759 1.84502463
F  0.4101897 -6.38212594 -0.37672626
F  -0.38082898 -5.29562676 -2.74200534
F  -0.96691182 -2.66025831 -2.87581723
F  -1.0942464 2.08173209 -1.13664517
F  0.70411623 3.67326481 -2.24265867
F  3.0950935 2.68908103 -3.04255337
F  3.61538412 0.03829171 -2.83066458
F  1.8157245 -1.60244602 -1.80965079
C  1.67221359 1.81380334 1.33327355
C  2.08664563 0.56752398 1.49147076
C  0.78005785 0.90750566 2.04950122
F  -0.35887261 0.43043614 1.3204007
C  3.0353666 -0.48775629 1.18474629
C  2.8705223 -1.77799146 1.7104363
C  4.09976657 -0.24478907 0.30164456
C  3.73415989 -2.806155 1.34163896
H  2.0494761 -1.97793207 2.39881583
C  4.96210878 -1.27305994 -0.0657905
H  4.24092548 0.75404291 -0.11762261
C  4.77892624 -2.55769299 0.44994289
H  3.58305237 -3.80972006 1.7487111
H  5.77674081 -1.07225573 -0.76630891
H  5.4520486 -3.36738996 0.15472703
C  1.82850717 3.16588645 0.83750923
C  3.00972042 3.57362776 0.19654018
C  0.77572917 4.08038657 0.99244429
C  3.13166753 4.87198534 -0.28717001
H  3.83756344 2.86973018 0.07983379
C  0.90606048 5.38129137 0.5114385
H  -0.13440873 3.7597322 1.50710947
C  2.07974048 5.7781158 -0.12991958
H  4.05200294 5.17999965 -0.79038913
H  0.08284484 6.09021869 0.63517813
H  2.17724346 6.7985219 -0.51121147
C  -2.3889683 -0.42086723 -0.76902319
C  -3.05211159 0.1820966 -1.84039597
C  -3.17249554 -0.73333463 0.34389846
C  -4.4068614 0.4920903 -1.80840252
F  -2.39221724 0.46844518 -2.95800073
C  -4.52634458 -0.42044964 0.41774104
F  -2.63705415 -1.33638456 1.39599113
C  -5.14533066 0.19443113 -0.66606429
F  -4.9971541 1.06057408 -2.84753445
F  -5.22827526 -0.70976081 1.50342304
F  -6.4302067 0.48804086 -0.61443846
C  0.3530978 1.00895887 3.52354466
C  -1.07419223 1.56997001 3.48238304
C  0.42275285 -0.35587195 4.21598123
C  1.252364 2.01578314 4.25260406
O  -1.34135016 2.70117087 3.15159885
O  -1.99814494 0.68122916 3.82006251
H  1.471848 -0.69528228 4.24755105
H  0.05731375 -0.28470685 5.25371254
H  -0.17749185 -1.1094062 3.68968493
H  2.30254429 1.6803327 4.21820833
H  1.18757634 3.01527423 3.79537601
H  0.9535405 2.09561551 5.3114788
C  -3.35503734 1.07576419 3.67908418
H  -3.60056663 1.88419816 4.38594571
H  -3.5466763 1.42401532 2.65150417
H  -3.95453297 0.18263078 3.89497821
