program: Gaussian 16
title: Title Card Required
version: ES64L-G16RevA.03
method: RwB97XD
basis: def2SVPP
operation: Freq
keyword: #N
keyword: Geom=AllCheck
keyword: Guess=TCheck
keyword: SCRF=Check
keyword: GenChk
keyword: RwB97XD/def2SVPP
keyword: Freq
converged: YES YES YES YES
title: Mulliken charges:
elementType: B C C C C C C C C C C C C C C C C C C F F F F F F F F F F F F F F F
charge: 0.174986 -0.122669 0.177109 0.177214 0.229555 0.229564 0.128798 -0.123558 0.177211 0.177100 0.229382 0.229554 0.128677 -0.122187 0.177022 0.177170 0.229685 0.229639 0.128759 -0.180806 -0.174714 -0.166622 -0.174679 -0.180813 -0.180760 -0.174660 -0.166552 -0.174669 -0.180757 -0.180886 -0.174715 -0.166748 -0.174712 -0.180919
chargesum: -0.00000
title: Mulliken charges with hydrogens summed into heavy atoms:
1716.lowfreq: -1.6523 0.0006 0.0006 0.0009 2.8183 4.6954 15.4459 17.1440 31.1170
frequency: 15.3991 17.1312 31.1107 32.4753 33.5285 34.3027 104.8264 108.9043 110.1268 132.1755 132.5553 132.7138 146.4139 147.1253 159.4699 160.6485 166.2256 166.3333 232.2380 237.1776 237.8449 276.9349 277.0797 277.2195 282.5863 283.0105 284.2120 320.9472 321.2509 321.4388 354.8996 354.9357 363.6384 366.0214 399.1361 400.3392 421.4256 422.1129 422.6249 449.3538 450.1314 450.4096 480.5182 480.7685 505.8953 554.2849 582.4443 584.0329 584.3628 587.1820 587.2577 589.5669 649.7269 650.0975 675.0910 675.2909 677.3518 699.7855 700.8385 712.5155 805.4110 805.4719 810.6888 883.4027 1019.4786 1019.6389 1022.2852 1058.9463 1059.1387 1157.1580 1198.2257 1201.2047 1201.4767 1218.7830 1218.9606 1333.8125 1336.5634 1336.6701 1358.2783 1372.8444 1373.0491 1452.2292 1452.7529 1469.4358 1549.4981 1555.4544 1555.9866 1595.8802 1596.9720 1597.3119 1706.5820 1708.5766 1708.6083 1724.8129 1725.1198 1727.1785
redmass: 17.2366 17.2164 17.5551 16.7398 16.7754 16.6231 16.9984 17.0919 17.1419 18.4416 18.4333 18.4023 16.4106 16.4250 16.0881 18.2035 18.1996 18.2064 14.0599 13.6993 13.6790 18.6585 18.7520 18.7392 18.4806 18.4726 18.5740 18.0867 18.0993 18.0901 17.3428 17.3277 17.2771 12.7570 12.7496 12.7478 12.6596 12.6613 12.6374 15.8912 15.9533 15.9528 15.1673 15.1585 16.1710 11.8063 12.2302 12.3393 12.4379 16.8477 16.6988 17.2007 13.0260 13.0198 12.2392 12.2373 12.2231 12.6128 12.6031 12.0797 12.6783 12.6788 12.3030 13.4363 13.9805 13.9807 14.1894 13.1089 13.1055 13.5201 13.6917 13.6667 13.6660 12.6824 12.6802 12.0090 12.0103 12.0100 12.8043 12.6019 12.6025 12.5096 12.5098 12.5548 12.3195 12.3138 12.3139 12.4900 12.4488 12.4491 12.0726 12.0695 12.0694 12.0494 12.0495 12.0443
irintensity: 0.6111 0.6067 0.0016 0.0447 0.0426 0.0671 0.2417 0.0265 0.0193 0.3750 0.3044 0.0916 0.0025 0.0008 0.0002 0.0247 0.1301 0.1222 9.7280 7.8318 7.7663 0.0805 0.4511 0.4346 0.0572 0.0637 0.0048 0.8185 0.6134 3.5709 7.8007 7.7165 0.0066 0.0845 7.4152 7.7783 1.1549 1.3185 0.1722 0.8988 0.4443 0.4775 7.3699 7.4308 0.0004 4.9902 3.4251 0.1621 0.0280 4.0247 4.1381 0.0031 62.6202 61.9799 1.2490 1.5621 0.0066 35.8605 35.1451 20.9998 43.7285 43.9706 11.6284 0.0010 132.4976 132.2918 361.2450 207.3941 207.4834 0.0007 6.8527 24.3019 24.6674 430.7652 435.7022 5.1549 4.4776 4.2858 0.0466 284.4963 285.1348 349.4045 347.1228 0.1271 833.7500 947.8514 941.9239 9.2660 263.4551 263.9519 12.7232 0.2929 0.3452 306.3933 299.7862 2.9883
temp: 298.150 k
press: 1.00000 atm
elementType: 5 6 6 6 6 6 6 6 6 6 6 6 6 6 6 6 6 6 6 9 9 9 9 9 9 9 9 9 9 9 9 9 9 9
symmnumber: 1
zpe: 412312.9 jmol-1
zpe.correction: 0.157042 hartree
zpe.thermalcorrener: 0.185708 hartree
zpe.thermalcorrenthalpy: 0.186652 hartree
zpe.thermalcorrgfe: 0.095279 hartree
zpe.sumelectzpe: -2205.819648 hartree
zpe.sumelectthermal: -2205.790982 hartree
zpe.sumelectthermalent: -2205.790038 hartree
zpe.sumelectthermalfe: -2205.881411 hartree
dipole: 0.0022 0.0167 -0.0006
dipole: 0.0169
quadrupole: -191.1879 -191.2831 -181.4546
quadrupole: 0.0417 0.0186 -0.0071
quadrupole: -3.2127 -3.3079 6.5206 0.0417 0.0186 -0.0071
hfenergy: -2205.9766899 hartree
pointgroup: C01 [X(C18B1F15)]
dipole: 0.0008621 0.0065855 -0.0002434 debye
polarizability: 292.3346754|0.0483643|292.0951163|-0.0686942|-0.0220362|169.3897699 unknown
InChI: InChI=1S/C18BF15/c20-4-1(5(21)11(27)16(32)10(4)26)19(2-6(22)12(28)17(33)13(29)7(2)23)3-8(24)14(30)18(34)15(31)9(3)25
charge 0 multiplicity 1
34 atoms
B  0.00032014 0.00139869 0.0010822
C  -1.47458056 0.54122162 -0.00099047
C  -1.85246951 1.66030276 0.74862545
C  -2.48365893 -0.07104368 -0.7519875
C  -3.15491469 2.14599438 0.76528659
C  -3.7922914 0.39770639 -0.77166228
C  -4.12674798 1.51053969 -0.00385367
C  0.26915692 -1.54617304 0.00167273
C  1.29958497 -2.1168703 -0.75283342
C  -0.50947358 -2.43024946 0.75596437
C  1.54503663 -3.48508951 -0.77169273
C  -0.28156774 -3.8015236 0.77359873
C  0.75017705 -4.3285516 0.0005937
C  1.20619633 1.00774219 0.00192267
C  1.18189296 2.19024009 -0.74545471
C  2.36512723 0.7710043 0.74913917
C  2.24405536 3.08689454 -0.764359
C  3.4387449 1.65399906 0.76675396
C  3.37570556 2.81550642 0.00079662
F  -0.96194055 2.29194295 1.50396737
F  -3.47784472 3.1979643 1.49893126
F  -5.36401538 1.96284714 -0.00520792
F  -4.71595928 -0.19848284 -1.50687394
F  -2.209189 -1.12869227 -1.50598362
F  0.12827345 2.48602606 -1.49699966
F  2.19050964 4.18715068 -1.49627839
F  4.38779525 3.65874652 0.00027067
F  4.51172629 1.40361777 1.49829065
F  2.46658742 -0.3183484 1.50112066
F  2.07651222 -1.35271505 -1.51114756
F  2.51886155 -3.98987345 -1.51063212
F  0.97469532 -5.6267018 0.00003854
F  -1.02945481 -4.60442945 1.51193668
F  -1.49740709 -1.9716761 1.51516096
