program: Gaussian 09
title: 000043331
version: EM64L-G09RevD.01
frameworkgroup: C1[X(C19H30N2O3)]
method: RPBEPBE
basis: SDD
operation: Freq
keyword: #p
keyword: freq=noraman
keyword: PBEPBE/SDD
title: #p freq=noraman PBEPBE/SDD
converged: YES YES NO NO
title: Mulliken charges:
elementType: O O O N N C C C C C C C C C C C C C C C C C C C H H H H H H H H H H H H H H H H H H H H H H H H H H H H H H
charge: -0.317542 -0.266200 -0.275471 -0.080827 -0.461053 -0.370441 -0.358765 -0.373130 -0.395723 -0.401194 -0.404691 -0.381206 -0.255437 0.258217 -0.381688 -0.342397 -0.291085 0.480039 0.345411 -0.686763 -0.433645 -0.365240 -0.361695 -0.334833 0.166626 0.209447 0.200354 0.187272 0.205870 0.188817 0.192141 0.220176 0.202605 0.191971 0.198634 0.204716 0.206294 0.219220 0.226127 0.238327 0.209933 0.209795 0.193892 0.193704 0.325869 0.201655 0.201553 0.212262 0.217583 0.212252 0.223155 0.297529 0.250200 0.247380
chargesum: 0.00000
title: Mulliken charges with hydrogens summed into heavy atoms:
elementType: O O O N N C C C C C C C C C C C C C C C C C C C
charge: -0.317542 -0.266200 -0.275471 -0.080827 -0.135183 0.005632 0.028861 0.021556 0.016594 -0.006618 -0.001340 0.044308 0.209018 0.258217 0.038040 0.045198 0.112122 0.480039 0.345411 -0.044666 -0.210490 -0.067711 -0.111495 -0.087453
polarizability: 3.74048273e+02 -1.49121145e+00 2.10082526e+02 -2.79890887e+00 -6.37153030e+00 1.54277745e+02
1716.lowfreq: -13.9528 -4.6462 -0.5722 -0.0021 0.0015 0.0025 6.7617 17.1506 22.2482
frequency: -11.6607 16.7642 22.1754 26.7833 47.6019 53.2045 54.1878 70.1286 74.6536 82.9555 103.8653 121.4122 128.4404 139.2573 145.3379 153.4502 192.2725 195.7363 221.6520 231.3353 246.5080 283.8672 300.0237 320.2636 324.6454 345.4850 369.7330 382.1494 395.4032 398.8696 414.4180 433.8615 492.6797 505.5457 522.4382 545.7160 583.3475 628.5632 629.0747 688.0741 694.5451 717.4754 718.4078 743.5315 746.4959 772.7688 788.3697 809.5352 813.0064 818.1134 836.0966 836.5526 849.9027 891.2436 903.7295 913.4790 932.8031 939.8240 940.4326 956.9456 967.0662 970.7669 981.6045 995.9327 1010.4781 1021.1271 1037.5707 1042.2373 1082.1735 1085.4620 1086.5818 1108.1610 1111.3344 1120.7331 1126.1330 1147.1787 1149.5202 1159.0066 1160.1409 1183.7083 1188.6682 1206.4634 1209.7266 1214.3337 1218.4762 1231.5939 1259.7126 1262.9578 1273.4406 1276.4046 1281.1514 1284.9563 1289.7728 1310.4873 1310.8284 1319.2463 1336.4900 1344.4493 1346.1942 1346.7080 1361.6475 1363.2533 1370.8866 1374.7153 1385.4351 1392.3836 1400.3906 1423.4236 1451.0593 1460.6513 1462.4331 1466.3961 1469.6525 1471.5853 1473.2928 1476.5455 1477.8406 1482.0239 1482.6978 1485.2480 1490.4583 1500.2199 1515.6332 1595.0579 1633.0663 1660.9718 2818.4810 2853.7374 2902.7648 2941.4442 2960.0931 2965.8152 2969.9611 2975.6310 2978.1542 2987.3833 2993.3155 2997.6556 3007.1029 3009.8295 3012.9152 3015.4718 3025.2602 3032.3455 3038.9678 3042.6640 3052.9686 3057.7157 3074.1713 3075.8335 3089.3570 3118.3505 3159.0092 3167.3106 3187.5439 3546.0160
redmass: 3.4410 4.2374 4.0245 4.3910 3.7960 2.4427 3.7852 3.2414 3.8467 3.0073 2.9260 2.8336 4.1594 2.3810 1.9891 3.4413 5.6288 3.3371 3.8345 1.1145 4.6888 1.8212 3.1162 3.1011 3.5501 5.5662 5.8689 2.8679 2.9529 2.4168 3.1070 4.0039 3.6675 1.9719 2.4002 2.3612 5.9873 1.7340 2.7319 4.2034 6.7079 4.1823 3.7206 1.0757 1.3062 5.9847 1.2067 1.1865 3.0148 1.3000 5.2618 1.5091 2.2600 1.4730 1.8011 7.4081 2.2463 1.2043 1.2923 2.1791 1.3130 6.9005 2.0538 3.8233 3.2060 2.1760 2.0697 3.4442 2.1078 2.1705 2.3840 2.1981 2.6782 1.6741 1.8085 1.4620 1.6489 1.9401 2.7761 1.2986 1.2335 1.3953 1.4316 1.3648 2.4943 1.3113 2.2696 1.1712 1.3152 1.1310 1.1755 1.0656 1.2750 1.2975 1.3702 1.3710 1.3513 1.4129 1.4843 1.3248 1.4085 1.4374 1.7853 1.9300 1.7036 1.2620 1.4488 3.8513 1.0874 1.0767 1.0808 1.0854 1.0796 1.0819 1.0745 1.0960 1.0422 1.1088 1.0872 1.0923 1.1440 1.8718 2.5441 5.5257 6.4878 8.8101 1.0712 1.0714 1.0699 1.0550 1.0600 1.0589 1.0625 1.0362 1.0639 1.0649 1.0592 1.1058 1.0922 1.1011 1.0920 1.0588 1.0932 1.0931 1.1008 1.0893 1.1005 1.1043 1.1014 1.0994 1.1082 1.0899 1.0891 1.0947 1.0951 1.0760
irintensity: 0.1492 0.0649 0.4441 0.4584 0.2535 3.1921 0.0809 1.4395 0.0742 0.8397 0.1216 1.0451 1.5927 2.2546 2.8543 3.2697 1.0900 3.4314 1.2063 0.0567 1.3119 0.8546 16.8957 2.1579 2.5652 5.2266 3.3041 2.1772 6.0671 3.8629 0.0184 13.5610 3.3643 0.8867 29.0847 3.6306 9.4479 35.0414 23.8294 23.5633 38.4160 9.1745 0.5650 10.9850 7.2964 18.3221 2.4335 0.2540 6.6573 29.9471 4.0185 75.6473 1.5098 1.8496 23.1294 5.9075 22.7877 0.0353 0.6193 17.4808 3.5872 128.9166 1.9005 132.2454 156.9641 38.6443 58.0906 16.5103 57.7759 10.8037 16.6340 10.9802 40.5231 3.8814 27.9883 1.6968 39.4438 125.2782 542.2641 6.2272 8.4901 2.0024 6.0911 0.0473 256.2700 8.4103 24.1762 1.4051 6.0998 1.6770 0.4409 0.0493 11.8445 9.7856 17.0047 9.9861 0.7162 0.7940 0.6122 1.3894 1.1718 1.8978 16.0620 68.4120 6.9795 9.0585 2.8364 60.9113 9.7763 3.2573 3.7853 1.6353 5.1685 26.1448 2.6571 38.2120 13.0167 40.5581 8.3811 23.4743 29.8485 20.0758 846.0049 18.2482 2.7909 245.3302 100.5931 90.9457 86.4352 31.0383 21.5465 33.9419 44.6477 37.5722 26.9464 54.2804 39.4085 28.4841 49.0132 4.9370 27.1734 34.0411 82.1602 22.0713 42.7137 25.2611 75.9659 20.2650 101.8456 50.0416 36.5394 21.0177 13.2295 6.3406 5.8924 28.7528
temp: 298.150 k
press: 1.00000 atm
elementType: 8 8 8 7 7 6 6 6 6 6 6 6 6 6 6 6 6 6 6 6 6 6 6 6 1 1 1 1 1 1 1 1 1 1 1 1 1 1 1 1 1 1 1 1 1 1 1 1 1 1 1 1 1 1
symmnumber: 1
zpe: 1218745.6 jmol-1
zpe.correction: 0.464196 hartree
zpe.thermalcorrener: 0.489011 hartree
zpe.thermalcorrenthalpy: 0.489955 hartree
zpe.thermalcorrgfe: 0.406398 hartree
zpe.sumelectzpe: -1075.312414 hartree
zpe.sumelectthermal: -1075.287599 hartree
zpe.sumelectthermalent: -1075.286655 hartree
zpe.sumelectthermalfe: -1075.370212 hartree
dipole: -0.6267 1.0224 -0.4967
dipole: 1.2980
quadrupole: -115.4931 -140.3142 -147.2381
quadrupole: -11.5476 3.2669 -0.0717
quadrupole: 18.8553 -5.9657 -12.8896 -11.5476 3.2669 -0.0717
hfenergy: -1075.7766099 hartree
pointgroup: C01 [X(C19H30N2O3)]
dipole: -0.2431365 0.3535989 -0.2768335 debye
polarizability: 373.8602779|-5.1222773|204.7731107|-4.6772806|-17.6329939|159.7751553 unknown
InChI: InChI=1S/C19H30N2O3/c1-2-3-15-23-18-10-8-17(9-11-18)20-19(22)24-16-14-21-12-6-4-5-7-13-21/h8-11,20H,2-7,12-16H2,1H3
charge 0 multiplicity 1
54 atoms
O  -1.875395 0.760686 -0.38446
O  5.999794 0.421152 -0.504514
O  -0.517631 -0.998614 0.405864
N  -5.540457 0.167452 0.084641
N  0.363808 0.970793 -0.58291
C  -6.598617 1.104968 0.533639
C  -5.982684 -0.832768 -0.927689
C  -7.840479 0.43621 1.167466
C  -6.802504 -1.991812 -0.313251
C  -8.755355 -0.298796 0.155637
C  -8.332339 -1.75243 -0.184404
C  -4.289342 0.863789 -0.307023
C  -3.073814 0.010183 0.077754
C  -0.638477 0.130315 -0.133989
C  8.166961 -0.56896 -0.091449
C  8.972236 -1.775176 0.445642
C  6.657436 -0.77891 0.043849
C  1.770943 0.75446 -0.52996
C  4.595568 0.462693 -0.482068
C  10.496667 -1.56903 0.315778
C  2.613532 1.777734 -1.045283
C  2.356164 -0.417559 0.008295
C  4.010067 1.634936 -1.022064
C  3.76121 -0.560291 0.030759
H  -6.954834 1.757052 -0.309129
H  -6.138724 1.774799 1.285645
H  -5.070239 -1.257155 -1.385639
H  -6.554439 -0.345442 -1.758632
H  -7.518192 -0.247384 1.976861
H  -8.424823 1.246774 1.647662
H  -6.645516 -2.905098 -0.921332
H  -6.360621 -2.194449 0.680047
H  -9.79347 -0.321527 0.542232
H  -8.792632 0.307096 -0.773328
H  -8.83435 -2.046617 -1.128011
H  -8.721013 -2.437102 0.595714
H  -4.247052 1.103411 -1.395877
H  -4.22538 1.825116 0.233919
H  -3.084191 -0.983847 -0.404459
H  -3.021047 -0.134504 1.170512
H  8.411604 -0.396432 -1.157207
H  8.45232 0.3496 0.456513
H  8.675589 -2.692305 -0.103286
H  8.712724 -1.949655 1.509953
H  0.038918 1.849613 -0.991072
H  6.328305 -1.675619 -0.523137
H  6.36863 -0.908886 1.108539
H  10.825147 -0.67653 0.880606
H  11.055409 -2.44004 0.703896
H  10.787944 -1.422976 -0.741234
H  2.173379 2.690954 -1.465545
H  1.713208 -1.205737 0.40563
H  4.664966 2.418009 -1.415525
H  4.185486 -1.475749 0.453025
