program: Gaussian 09
title: 000043327
version: EM64L-G09RevD.01
frameworkgroup: C1[X(C19H30N2O3)]
method: RPBEPBE
basis: SDD
operation: Freq
keyword: #p
keyword: freq=noraman
keyword: PBEPBE/SDD
title: #p freq=noraman PBEPBE/SDD
converged: YES YES NO NO
title: Mulliken charges:
elementType: O O O N N C C C C C C C C C C C C C C C C C C C H H H H H H H H H H H H H H H H H H H H H H H H H H H H H H
charge: -0.310654 -0.320977 -0.276944 -0.080489 -0.446870 -0.369645 -0.358632 -0.375359 -0.397044 -0.401200 -0.405177 -0.380108 -0.255993 0.252646 -0.386688 -0.277182 0.266399 -0.341341 0.210105 -0.685893 -0.332837 -0.322739 -0.234130 -0.255673 0.165569 0.209826 0.200993 0.186432 0.206139 0.189050 0.192904 0.220210 0.202318 0.192180 0.198340 0.204662 0.205827 0.219954 0.227776 0.236414 0.210155 0.210656 0.361297 0.206644 0.206369 0.195478 0.194921 0.212661 0.219288 0.212783 0.301088 0.246571 0.226036 0.223889
chargesum: 0.00000
title: Mulliken charges with hydrogens summed into heavy atoms:
elementType: O O O N N C C C C C C C C C C C C C C C C C C C
charge: -0.310654 -0.320977 -0.276944 -0.080489 -0.085573 0.005749 0.028792 0.019829 0.016069 -0.006702 -0.002176 0.045672 0.208198 0.252646 0.034123 0.135830 0.266399 0.049058 0.210105 -0.041161 -0.031749 -0.076167 -0.008093 -0.031784
polarizability: 3.13042344e+02 1.26108982e+01 2.55299650e+02 -3.74807973e+00 -4.45558979e+00 1.52945930e+02
1716.lowfreq: -0.0012 -0.0008 -0.0003 1.9770 4.2204 4.7428 21.1342 23.0932 28.2094
frequency: 21.0838 22.9544 26.6674 36.1408 45.6686 58.5868 63.4039 76.2910 84.1072 92.1682 108.0081 125.4713 138.6196 139.8618 155.3182 161.5433 186.9695 208.6244 216.6042 231.8264 241.1201 291.5190 301.7430 304.6961 310.6630 325.1093 345.2603 387.9091 401.3240 407.3401 439.3005 455.0434 508.9102 513.1792 552.2722 558.0350 588.2419 602.2756 687.4966 690.3945 721.8512 724.3215 743.3572 746.1183 747.0973 754.4912 781.7040 788.4676 814.5932 816.0723 834.7029 854.2226 854.3879 893.2090 904.4823 916.3483 932.7487 937.1091 942.6790 960.1397 976.0261 979.2573 983.3979 1002.8328 1021.9742 1039.9176 1041.9811 1044.5088 1082.4661 1084.0881 1086.0187 1108.4292 1109.5714 1110.9905 1124.0006 1147.9298 1152.3004 1159.8885 1167.7610 1174.4066 1188.0055 1195.9885 1207.7832 1212.6326 1214.5529 1231.0792 1256.0555 1262.7629 1274.3556 1276.1254 1281.0530 1287.3022 1290.0356 1307.4177 1309.0335 1319.6758 1336.8257 1345.4075 1346.9434 1348.2316 1360.8634 1364.0718 1373.1961 1378.9550 1392.7716 1397.1250 1401.4937 1442.1001 1451.9661 1463.3411 1465.0169 1467.1860 1471.3201 1471.5354 1473.3553 1475.8505 1477.3947 1477.9455 1485.4034 1486.6852 1488.3584 1493.9614 1523.1119 1604.3872 1611.8328 1658.2501 2818.7118 2855.6402 2901.9408 2950.6508 2959.8541 2968.3527 2969.6191 2976.8326 2978.5252 2987.0207 2992.4504 3006.8161 3007.8666 3012.6812 3013.6081 3015.2934 3026.2412 3033.9258 3039.3127 3043.1466 3052.2623 3058.0166 3075.0111 3077.7927 3088.2145 3135.1526 3153.0447 3169.0875 3188.2405 3518.6570
redmass: 4.1977 4.3668 3.2427 4.5079 3.8365 2.1792 3.5197 4.5823 4.0017 2.6030 2.8619 3.1222 1.9821 2.2791 3.1764 4.2277 3.0727 5.4758 3.5700 1.1508 4.5356 1.8430 3.0867 4.3647 5.1401 2.7304 4.7402 2.8625 2.8362 2.6063 3.7190 3.2989 2.0655 4.1429 2.2919 3.8772 6.6266 6.0876 5.1593 3.8383 4.2615 2.6924 1.2144 1.3282 1.3100 1.2692 5.9245 1.2277 1.1425 2.9835 5.2475 2.1435 1.4089 1.4472 1.8079 7.2700 1.3323 2.2126 1.1613 2.1995 6.9163 1.2925 2.0587 6.3775 1.9712 2.0338 3.4913 2.0642 2.3519 2.2040 2.1169 2.1005 2.2060 2.6818 2.6044 1.4613 1.6894 1.8181 2.7196 1.0610 1.2460 2.7640 1.4242 1.3650 1.3595 1.3152 1.9573 1.1678 1.2955 1.1312 1.1819 1.0738 1.2780 1.6451 1.2475 1.3703 1.3456 1.4073 1.3549 1.4724 1.4051 1.4053 1.4093 1.5146 1.2896 1.8797 2.4518 2.4874 1.0885 1.0803 1.1017 1.5451 1.0841 1.0875 1.0995 1.1422 1.1009 1.0603 1.1009 1.1121 1.0879 1.1308 2.7328 5.7973 6.5493 9.3987 1.0708 1.0713 1.0699 1.0553 1.0603 1.0590 1.0626 1.0363 1.0639 1.0645 1.0591 1.1043 1.0933 1.1026 1.0912 1.0585 1.0945 1.0917 1.1009 1.0898 1.1007 1.1047 1.1013 1.0995 1.1083 1.0856 1.0914 1.0970 1.0957 1.0758
irintensity: 0.1244 0.3309 0.1747 0.1395 0.0097 0.9864 1.1080 0.8870 0.2425 0.5173 2.3403 0.1137 0.8414 1.3600 2.3459 0.7446 1.4311 3.3752 2.1041 0.2089 4.8530 1.4765 11.2922 4.8368 2.2975 7.8049 1.0861 3.5118 5.8341 3.2070 12.2204 7.8611 0.3713 1.7963 0.8940 0.9134 6.8128 1.5438 0.3343 19.4063 4.0465 5.8018 8.6244 24.9676 7.7461 171.5117 7.5287 3.1919 1.6381 4.6044 9.0711 1.7298 0.5972 1.8172 19.8038 6.4042 7.5551 18.9103 0.0661 15.5178 97.7314 2.4865 3.3463 325.3483 11.6471 48.3868 21.5975 21.6219 63.7884 6.7528 4.3916 53.8547 27.0735 34.7132 11.5698 1.7753 45.9323 4.4857 397.6643 3.0832 5.3917 146.1796 2.8995 8.5381 0.0012 9.7272 114.5372 0.8683 11.7654 1.6650 1.2651 0.1834 11.9141 36.5953 6.5149 11.2687 0.8183 0.8665 1.5232 1.9672 0.9465 0.9299 1.7323 42.6818 23.4817 13.0264 4.8715 174.3939 9.0678 1.4930 9.3620 86.0850 3.0324 9.5357 12.7770 34.3925 12.4263 13.3930 9.4097 16.6895 9.0062 32.4510 580.7508 28.7761 130.3473 230.3291 97.4359 85.6563 85.7915 32.9341 21.3047 35.5307 44.5663 31.5778 28.0451 53.0702 40.1428 24.2452 43.6369 0.7184 28.4034 35.2924 84.7473 20.4819 42.2910 24.1865 75.6308 23.3909 96.5949 50.3970 37.9187 1.3505 27.6395 17.1821 6.4941 81.6939
temp: 298.150 k
press: 1.00000 atm
elementType: 8 8 8 7 7 6 6 6 6 6 6 6 6 6 6 6 6 6 6 6 6 6 6 6 1 1 1 1 1 1 1 1 1 1 1 1 1 1 1 1 1 1 1 1 1 1 1 1 1 1 1 1 1 1
symmnumber: 1
zpe: 1220791.0 jmol-1
zpe.correction: 0.464975 hartree
zpe.thermalcorrener: 0.490432 hartree
zpe.thermalcorrenthalpy: 0.491377 hartree
zpe.thermalcorrgfe: 0.406125 hartree
zpe.sumelectzpe: -1075.315537 hartree
zpe.sumelectthermal: -1075.290079 hartree
zpe.sumelectthermalent: -1075.289135 hartree
zpe.sumelectthermalfe: -1075.374387 hartree
dipole: -1.5169 4.2756 0.6000
dipole: 4.5762
quadrupole: -114.8382 -146.6380 -147.1986
quadrupole: -3.9156 0.0548 -1.7258
quadrupole: 21.3867 -10.4131 -10.9736 -3.9156 0.0548 -1.7258
hfenergy: -1075.7805116 hartree
pointgroup: C01 [X(C19H30N2O3)]
dipole: 0.465828 -1.7318245 0.1590781 debye
polarizability: 314.3955558|7.7632666|253.0788057|7.3471651|9.251765|153.8135616 unknown
InChI: InChI=1S/C19H30N2O3/c1-2-3-15-23-18-11-7-6-10-17(18)20-19(22)24-16-14-21-12-8-4-5-9-13-21/h6-7,10-11,20H,2-5,8-9,12-16H2,1H3
charge 0 multiplicity 1
54 atoms
O  -0.756008 0.296095 -0.178513
O  3.553145 -0.814903 0.112706
O  -0.088031 2.553078 -0.05645
N  -4.468541 -0.166531 -0.276115
N  1.449307 0.748088 0.000307
C  -5.282826 -1.162003 -1.016175
C  -4.993517 0.189831 1.072694
C  -6.755576 -0.756968 -1.257816
C  -6.207846 1.146753 1.015172
C  -7.645843 -0.803765 0.009463
C  -7.601308 0.471799 0.891749
C  -3.027197 -0.523823 -0.247714
C  -2.168605 0.747114 -0.291796
C  0.198085 1.328623 -0.075032
C  4.084236 -3.178241 0.096031
C  4.673119 -1.769637 0.196497
C  2.695649 1.408622 0.123072
C  5.174127 -4.270492 0.205314
C  3.846717 0.562689 0.186746
C  4.589413 -5.695262 0.098883
C  2.862851 2.811127 0.186542
C  5.137293 1.112454 0.312694
C  4.161299 3.358126 0.312082
C  5.293087 2.518753 0.375445
H  -5.285503 -2.158412 -0.496721
H  -4.793616 -1.313027 -1.997797
H  -4.175291 0.698977 1.614134
H  -5.242288 -0.725891 1.668154
H  -6.789939 0.245683 -1.726355
H  -7.161402 -1.471626 -2.001798
H  -6.209929 1.781377 1.923796
H  -6.032186 1.823266 0.1580
H  -8.698657 -0.988799 -0.281868
H  -7.339563 -1.684947 0.610639
H  -7.977388 0.209822 1.901159
H  -8.30938 1.221698 0.485829
H  -2.747164 -1.128056 0.647539
H  -2.789036 -1.138681 -1.13432
H  -2.393876 1.439874 0.538556
H  -2.307785 1.289136 -1.243103
H  3.335323 -3.313739 0.90016
H  3.547203 -3.278156 -0.866853
H  1.4915 -0.274918 -0.030872
H  5.203755 -1.626366 1.160897
H  5.384571 -1.574603 -0.632834
H  5.710598 -4.162213 1.169929
H  5.930131 -4.121506 -0.592537
H  4.070687 -5.839378 -0.867309
H  5.381771 -6.461725 0.175262
H  3.856224 -5.884387 0.905091
H  1.979022 3.450741 0.137869
H  6.017061 0.464465 0.362544
H  4.280613 4.445585 0.360146
H  6.296412 2.946579 0.473178
