program: Gaussian 09
title: 000005071
version: EM64L-G09RevD.01
frameworkgroup: C1[X(C12H21N)]
method: RPBEPBE
basis: SDD
operation: Freq
keyword: #pfreq=noraman
keyword: PBEPBE/SDD
title: #p freq=noraman PBEPBE/SDD
converged: NO YES NO NO
title: Mulliken charges:
elementType: N C C C C C C C C C C C C H H H H H H H H H H H H H H H H H H H H H
charge: -0.620146 0.522199 -0.103351 -0.096541 -0.106866 -0.552934 -0.555615 -0.547714 -0.452049 -0.451676 -0.450916 -0.154490 -0.775768 0.191303 0.190914 0.190822 0.196736 0.234799 0.192455 0.196113 0.202631 0.193805 0.193127 0.190090 0.193956 0.191678 0.194628 0.189953 0.192640 0.226228 0.239298 0.206583 0.270030 0.268079
chargesum: 0.00000
title: Mulliken charges with hydrogens summed into heavy atoms:
elementType: N C C C C C C C C C C C C
charge: -0.082037 0.522199 0.087952 0.094373 0.083956 -0.121399 -0.167047 -0.151279 -0.068831 -0.066042 -0.066336 0.038150 -0.103659
polarizability: 1.37829551e+02 1.07466289e+00 1.19477320e+02 -1.04442650e+00 3.18438987e-01 1.14342399e+02
1716.lowfreq: -21.5444 -10.6984 -0.0004 -0.0001 0.0005 24.4813 64.2480 169.4570 177.3676
frequency: 64.0658 169.4192 177.3499 212.6275 242.3902 296.1909 297.2260 302.9983 336.1538 380.3740 397.3414 409.8962 424.3521 426.1344 446.7408 478.0636 564.6039 637.2839 639.1356 643.0885 694.5414 765.7113 807.4156 811.1323 855.5350 870.9295 872.9043 875.9482 920.3258 931.9713 941.3122 966.3251 970.0768 977.3896 985.7360 1024.6957 1044.1349 1049.0572 1057.5792 1089.7631 1101.0268 1103.1570 1107.1405 1110.4706 1113.6284 1139.1507 1181.1347 1189.0358 1221.7303 1254.8830 1259.3472 1283.9826 1285.4611 1291.7529 1303.3339 1308.7482 1314.4468 1324.4362 1331.1317 1337.4250 1342.7841 1347.6072 1355.8938 1358.1716 1369.6268 1384.1127 1450.8615 1453.2683 1462.3488 1465.0845 1466.1748 1472.0204 1485.1404 1486.5039 1637.8814 2830.4290 2944.3458 2950.1826 2956.6317 2958.1961 2959.4230 2967.7898 2982.2837 2985.9671 2987.0250 2999.6861 3009.9161 3012.5103 3015.7675 3020.3774 3023.7468 3035.0555 3067.3415 3099.2271 3455.8497 3580.1814
redmass: 2.5180 2.5755 2.7152 1.1419 1.0988 2.5654 2.1964 2.3583 2.3732 3.2933 4.5466 2.3409 1.7521 1.9172 2.2776 2.1420 1.7138 2.2420 3.8161 2.8075 3.5756 3.7590 2.7644 2.6938 2.7882 1.5901 1.5749 1.5576 2.2512 1.9388 2.1208 2.0821 2.1145 1.9079 1.7926 1.7505 1.7527 1.7451 1.8372 2.1500 1.1222 1.4340 1.4264 1.1758 1.2333 1.8143 1.2247 1.2854 1.3118 1.6242 1.6565 1.8866 1.8512 1.8841 2.1710 1.7050 1.6225 1.3133 1.3907 1.5238 1.4417 1.4978 1.4548 1.5891 1.5797 1.2544 1.0831 1.0825 1.0901 1.0891 1.0849 1.0538 1.0801 1.0628 1.0963 1.0818 1.0612 1.0618 1.0638 1.0610 1.0617 1.0623 1.0386 1.0836 1.0821 1.0831 1.0999 1.1011 1.1021 1.1005 1.1022 1.1007 1.0963 1.0986 1.0451 1.0971
irintensity: 0.6552 8.8916 0.0204 33.8587 18.3313 0.6474 0.7627 0.4711 0.3616 1.1953 0.1707 0.6854 0.3179 1.1732 1.9688 5.6189 80.7873 52.3074 0.5695 29.4934 2.4649 0.8825 2.1516 1.7957 0.6960 0.0426 0.0158 0.0343 1.5685 1.7438 0.6649 3.4909 2.6779 3.4553 2.5023 7.0357 0.3907 0.0601 1.3286 3.5051 1.7141 3.4276 5.4543 0.1026 0.1498 12.3561 0.1596 3.3624 2.4209 2.9978 19.3691 0.4077 5.4584 0.4275 2.8687 2.3512 0.8321 0.0125 6.7040 1.7455 5.1619 0.9045 14.3006 0.4483 4.0408 29.6324 1.2406 1.7427 8.9201 15.7636 14.3041 15.9488 2.0495 2.5503 64.4135 81.6523 20.9701 59.3951 27.3003 21.4672 15.6411 36.1614 41.5035 155.5934 188.1607 51.0020 15.8339 3.7470 34.6823 58.4242 100.7537 46.9818 40.9450 26.9932 1.7173 0.2092
temp: 298.150 k
press: 1.00000 atm
elementType: 7 6 6 6 6 6 6 6 6 6 6 6 6 1 1 1 1 1 1 1 1 1 1 1 1 1 1 1 1 1 1 1 1 1
symmnumber: 1
zpe: 813453.2 jmol-1
zpe.correction: 0.309828 hartree
zpe.thermalcorrener: 0.321445 hartree
zpe.thermalcorrenthalpy: 0.322389 hartree
zpe.thermalcorrgfe: 0.273817 hartree
zpe.sumelectzpe: -523.596203 hartree
zpe.sumelectthermal: -523.584586 hartree
zpe.sumelectthermalent: -523.583642 hartree
zpe.sumelectthermalfe: -523.632214 hartree
dipole: -0.7256 0.1538 -0.9101
dipole: 1.1741
quadrupole: -76.9572 -80.0815 -83.0191
quadrupole: -1.2450 2.0485 -1.6449
quadrupole: 3.0621 -0.0622 -2.9998 -1.2450 2.0485 -1.6449
hfenergy: -523.9060312 hartree
pointgroup: C01 [X(C12H21N1)]
dipole: 0.2831805 -0.0260459 -0.3639984 debye
polarizability: 137.8476442|0.9218647|119.4854861|0.9992789|0.1769536|114.3161397 unknown
InChI: InChI=1S/C12H21N/c1-8(13)12-5-9-2-10(6-12)4-11(3-9)7-12/h8-11H,2-7,13H2,1H3
charge 0 multiplicity 1
34 atoms
N  2.896738 -1.254107 0.058425
C  0.738376 0.01923 -0.188481
C  -1.153286 0.059131 1.527854
C  -1.453933 1.24722 -0.694091
C  -1.437885 -1.281224 -0.602923
C  0.387761 0.070259 1.325364
C  0.086858 1.246721 -0.895913
C  0.102542 -1.272039 -0.794564
C  -1.774777 1.297252 0.824686
C  -1.757886 -1.232569 0.915491
C  -2.057721 -0.044541 -1.305929
C  2.287926 0.004094 -0.441959
C  3.047541 1.177627 0.214772
H  -1.379813 0.0961 2.612437
H  -1.887284 2.13564 -1.196007
H  -1.856124 -2.208734 -1.043312
H  0.803275 0.991056 1.781614
H  0.8612 -0.791132 1.834502
H  0.325975 1.224059 -1.980422
H  0.505729 2.189846 -0.491753
H  0.529753 -2.164395 -0.295918
H  0.35012 -1.336485 -1.876138
H  -2.872933 1.31272 0.978947
H  -1.368921 2.229099 1.268611
H  -1.337502 -2.12538 1.420798
H  -2.855495 -1.251731 1.073129
H  -3.159463 -0.046904 -1.180364
H  -1.851681 -0.082326 -2.395077
H  2.411346 0.108914 -1.551858
H  2.609252 2.153089 -0.054065
H  3.039273 1.078411 1.314731
H  4.103818 1.185559 -0.117494
H  3.907357 -1.184602 0.214831
H  2.656765 -2.087458 -0.486425
