program: Gaussian 09
title: 000043260
version: EM64L-G09RevD.01
frameworkgroup: C1[X(C10H15NO3)]
method: RPBEPBE
basis: SDD
operation: Freq
keyword: #p
keyword: freq=noraman
keyword: PBEPBE/SDD
title: #p freq=noraman PBEPBE/SDD
converged: YES YES NO NO
title: Mulliken charges:
elementType: O O O N C C C C C C C C C C H H H H H H H H H H H H H H H
charge: -0.460244 -0.278480 -0.271901 -0.637365 -0.177163 0.459302 -0.493722 0.192388 -0.588188 0.336116 -0.334064 -0.382119 -0.537218 -0.537378 0.177671 0.281581 0.214984 0.242321 0.235457 0.247290 0.367365 0.299577 0.285250 0.226941 0.211744 0.239609 0.216006 0.242319 0.221919
chargesum: 0.00000
title: Mulliken charges with hydrogens summed into heavy atoms:
elementType: O O O N C C C C C C C C C C
charge: -0.092878 -0.278480 -0.271901 -0.052538 0.000508 0.459302 0.002844 0.192388 -0.345868 0.336116 -0.098606 -0.134829 0.141076 0.142866
polarizability: 1.71645740e+02 8.19377723e+00 1.39559240e+02 1.27793109e+00 -1.09470487e+00 7.82212590e+01
1716.lowfreq: -12.5866 -2.9689 -0.0007 -0.0006 -0.0004 3.8346 56.7769 61.3164 64.8463
frequency: 56.7626 61.2866 64.7846 82.1836 121.2784 158.9758 167.9084 179.5635 229.1139 252.4660 259.9380 272.2142 286.2380 313.7811 333.9970 381.5293 413.1263 437.0258 480.9096 506.9703 573.5354 609.5936 646.8498 674.9695 700.5917 737.7433 747.1327 761.1707 807.5969 847.9146 864.5185 917.7108 927.7110 944.5925 987.5833 1005.8219 1033.8051 1060.4926 1105.4097 1110.2365 1113.6737 1144.9010 1148.1707 1158.6774 1177.6670 1200.8251 1247.2039 1274.8879 1277.6191 1296.9766 1330.4670 1357.7223 1379.2348 1393.6306 1430.7001 1437.9109 1447.4456 1466.0001 1466.0146 1472.1721 1473.6971 1476.4177 1497.7178 1592.7833 1619.5443 1639.6814 2886.1915 2952.3714 2953.4188 2966.3712 3037.1136 3040.8093 3095.6596 3118.0786 3119.7212 3142.3203 3151.7344 3172.8397 3202.3092 3469.8162 3596.1065
redmass: 3.7622 2.8802 3.0991 3.8746 3.6317 3.7899 3.1501 3.3965 1.2890 1.3752 2.4071 1.1886 3.1057 4.3228 3.9884 4.7388 5.3211 4.0523 3.0974 3.5659 2.9827 3.8238 5.6300 1.2580 5.0821 3.2953 4.3818 1.1708 1.5142 3.6519 1.5856 1.8741 1.3646 2.8217 8.3128 4.7539 3.7714 3.2254 1.8762 1.2589 1.2599 1.4150 1.5331 1.4025 1.4631 2.7989 3.2377 1.5213 1.2900 1.2501 1.2114 1.2655 2.9491 2.6313 1.3500 1.2112 1.7055 1.0512 1.0523 1.1623 1.0842 1.0569 2.1232 8.0943 6.3656 1.0926 1.0833 1.0333 1.0337 1.0689 1.1035 1.1029 1.0947 1.0992 1.0988 1.0901 1.0870 1.0964 1.0630 1.0461 1.0976
irintensity: 5.4034 4.0239 5.3158 2.7998 7.5349 3.7531 5.9138 1.5364 1.7676 3.6498 3.9888 9.7016 0.8909 3.6015 3.3814 0.6069 0.0662 4.6770 3.9771 3.6646 20.9057 7.0168 5.5274 121.0567 60.7732 9.6999 16.2396 137.0982 49.4121 36.3029 28.9107 6.1560 0.6921 6.6023 30.0116 90.6891 19.9183 23.0917 27.3098 0.6865 0.1513 33.9522 6.5439 4.9837 44.4921 272.8680 5.2537 22.0863 19.7392 6.0501 30.5729 6.9774 47.5868 37.6206 62.2273 1.1377 10.7148 27.1017 4.5940 168.2703 17.3108 4.1382 115.0638 0.0082 14.0774 37.0358 78.6884 132.6944 15.0442 61.6594 52.2708 49.5089 7.0954 25.9902 29.0467 12.6388 7.5296 10.1197 175.8219 0.2207 5.9584
temp: 298.150 k
press: 1.00000 atm
elementType: 8 8 8 7 6 6 6 6 6 6 6 6 6 6 1 1 1 1 1 1 1 1 1 1 1 1 1 1 1
symmnumber: 1
zpe: 625357.7 jmol-1
zpe.correction: 0.238186 hartree
zpe.thermalcorrener: 0.253042 hartree
zpe.thermalcorrenthalpy: 0.253986 hartree
zpe.thermalcorrgfe: 0.196385 hartree
zpe.sumelectzpe: -669.354341 hartree
zpe.sumelectthermal: -669.339485 hartree
zpe.sumelectthermalent: -669.338541 hartree
zpe.sumelectthermalfe: -669.396141 hartree
dipole: 1.6862 -0.8192 -2.9700
dipole: 3.5121
quadrupole: -71.6975 -63.3240 -91.2762
quadrupole: 4.9348 -7.5532 3.9642
quadrupole: 3.7351 12.1086 -15.8436 4.9348 -7.5532 3.9642
hfenergy: -669.5925267 hartree
pointgroup: C01 [X(C10H15N1O3)]
dipole: 0.6558139 0.3115843 1.1756506 debye
polarizability: 171.1880377|-9.0501888|140.0171996|0.0358909|-1.5883885|78.2210022 unknown
InChI: InChI=1S/C10H15NO3/c1-13-7-3-4-10(14-2)8(5-7)9(12)6-11/h3-5,9,12H,6,11H2,1-2H3
charge 0 multiplicity 1
29 atoms
O  2.03693 1.115553 -1.449623
O  1.685428 -1.532658 0.076135
O  -3.614087 0.425439 0.075443
N  3.604571 1.934381 0.53596
C  1.321749 1.332611 -0.192972
C  0.17061 0.348607 -0.047546
C  2.354686 1.270708 0.982748
C  0.356345 -1.060874 0.058736
C  -1.1510 0.855073 -0.039721
C  -2.271851 -0.003025 0.064539
C  -0.766486 -1.920687 0.153391
C  -2.073651 -1.397384 0.157191
C  1.892227 -2.977415 -0.010237
C  -3.859346 1.861564 -0.046187
H  0.882146 2.358518 -0.205561
H  2.59014 0.214466 1.185228
H  1.906784 1.716221 1.895043
H  -1.283197 1.937656 -0.140047
H  -0.634663 -3.003962 0.22798
H  -2.946003 -2.053926 0.228258
H  2.984185 1.377566 -1.205694
H  4.465263 1.528057 0.910357
H  3.600661 2.957177 0.604845
H  1.416613 -3.397252 -0.91769
H  1.505754 -3.50228 0.886533
H  2.983127 -3.107934 -0.071341
H  -3.412334 2.422429 0.798925
H  -4.953829 1.971053 -0.023483
H  -3.465271 2.260919 -1.001708
