program: Gaussian 09
title: 000043254
version: EM64L-G09RevD.01
frameworkgroup: C1[X(C24H14)]
method: RPBEPBE
basis: SDD
operation: Freq
keyword: #p
keyword: freq=noraman
keyword: PBEPBE/SDD
title: #p freq=noraman PBEPBE/SDD
converged: YES YES NO YES
title: Mulliken charges:
elementType: C C C C C C C C C C C C C C C C C C C C C C C C H H H H H H H H H H H H H H
charge: -0.542457 0.299148 0.251040 0.267387 0.291278 0.385567 0.263066 -0.759052 0.526919 -0.674429 -0.702536 -0.437829 0.459014 0.447027 -0.422758 -0.225129 -0.383091 -0.488123 -0.450112 -0.448839 -0.254360 -0.248512 -0.243607 -0.242564 0.251645 0.253181 0.253584 0.249622 0.227691 0.222265 0.230593 0.246469 0.240974 0.240980 0.229437 0.230121 0.228265 0.228126
chargesum: 0.00000
title: Mulliken charges with hydrogens summed into heavy atoms:
elementType: C C C C C C C C C C C C C C C C C C C C C C C C
charge: -0.542457 0.299148 0.251040 0.267387 0.291278 0.385567 0.263066 -0.507407 0.526919 -0.421248 -0.448951 -0.188207 0.459014 0.447027 -0.195067 -0.002864 -0.152498 -0.241654 -0.209138 -0.207859 -0.024923 -0.018391 -0.015342 -0.014439
polarizability: 5.52481806e+02 4.42329259e+00 3.00486176e+02 2.26140680e-03 -2.98106833e-06 9.40741125e+01
1716.lowfreq: -0.0014 -0.0004 0.0012 6.3222 7.2778 13.2070 49.0709 75.3630 103.9729
frequency: 48.9975 75.3557 103.9692 108.8773 120.3344 178.5741 229.8951 239.0211 244.4600 272.8621 298.4033 305.0547 340.6729 404.8268 417.1376 443.6046 463.7999 474.9524 481.6430 514.7948 520.7509 551.7082 560.4922 573.6458 599.4034 609.1207 614.8010 628.9229 640.9873 662.5374 747.8796 754.4907 754.7256 756.8128 767.9928 777.2694 783.6718 810.1624 812.4897 828.4933 859.7407 863.7938 882.1611 886.3660 909.2459 919.4369 927.2863 933.8161 949.6009 964.9997 967.0812 980.8619 985.6150 989.1587 991.4935 1024.7551 1034.1413 1053.8177 1068.2874 1107.0474 1137.0926 1142.1937 1172.1471 1175.1282 1190.7583 1205.8332 1214.7328 1224.9317 1243.6177 1257.3838 1267.6742 1287.9510 1322.7262 1335.1748 1349.2399 1387.6993 1406.6223 1410.8011 1416.1930 1427.5231 1439.5912 1450.2113 1464.5591 1473.2382 1483.3923 1509.3114 1534.0004 1584.5696 1606.4135 1614.8429 1617.8459 1621.0684 1635.4695 1643.9543 3117.7080 3120.2255 3121.4486 3122.4089 3124.9375 3126.0049 3126.5648 3131.3367 3141.0462 3141.2429 3146.5592 3158.4535 3161.1887 3163.9135
redmass: 5.4189 4.1986 4.2389 5.5556 4.7129 4.8305 4.0591 5.1418 4.2138 6.2093 3.8613 5.0619 4.2715 5.7918 3.2578 3.7184 6.4859 2.6739 3.7977 3.1642 7.7279 5.8925 3.3683 7.0072 5.4316 6.5954 3.7656 6.7639 3.2048 6.4206 5.5725 5.8789 1.6785 1.3341 1.5633 2.7967 1.9669 4.8755 2.0614 5.8895 1.9558 1.3815 1.8725 5.4306 1.4437 1.5490 4.6823 2.0168 1.9696 1.4464 1.6038 1.3791 5.1895 1.3496 1.3693 2.2690 2.4931 2.1328 3.0530 2.7239 1.6629 1.7348 1.0827 1.0826 1.3162 1.3377 1.7073 1.4709 2.9148 2.3239 2.0989 2.1040 2.3003 1.8263 2.8284 4.4082 3.4035 6.4636 2.4615 3.3567 3.3176 3.1441 3.4218 3.3345 4.2859 4.1178 4.7885 7.6477 8.0806 6.9376 6.5117 6.7337 7.9700 7.8547 1.0862 1.0873 1.0912 1.0899 1.0899 1.0873 1.0910 1.0878 1.0927 1.0937 1.0937 1.0982 1.1003 1.1002
irintensity: 0.9217 0.0352 0.5739 0.0681 0.9985 0.0646 1.6847 0.0015 0.1651 0.1876 1.8574 0.4622 0.5381 0.5005 0.1489 1.2716 0.3319 19.6803 0.1535 6.4613 1.5829 0.3706 0.2255 15.0955 0.5993 1.8038 1.0416 1.8952 0.3792 1.1363 0.3823 0.0835 95.5391 30.3845 15.9774 30.2388 12.9001 0.0530 19.4985 0.5065 18.4274 4.1258 0.0635 0.1730 52.5686 8.8042 0.1621 2.2730 1.3636 23.1706 0.6451 1.9017 1.5203 0.0000 0.5578 7.6360 7.4303 2.4928 3.0362 1.5829 1.3273 4.0819 0.0094 0.3991 0.7308 4.9010 7.3302 4.0121 1.8980 4.2779 4.8677 0.9520 0.4012 2.0713 1.9558 0.9004 2.4990 1.6769 10.0997 1.0094 31.9021 1.8119 18.9335 5.5708 28.5215 6.2022 14.1123 2.4707 13.0983 1.1733 0.1521 4.5510 3.2181 0.7786 2.5402 3.0106 9.8106 3.1441 15.1706 0.6666 1.2368 4.9974 1.5810 43.2158 13.6715 44.7901 60.5395 48.4008
temp: 298.150 k
press: 1.00000 atm
elementType: 6 6 6 6 6 6 6 6 6 6 6 6 6 6 6 6 6 6 6 6 6 6 6 6 1 1 1 1 1 1 1 1 1 1 1 1 1 1
symmnumber: 1
zpe: 777448.4 jmol-1
zpe.correction: 0.296114 hartree
zpe.thermalcorrener: 0.311967 hartree
zpe.thermalcorrenthalpy: 0.312911 hartree
zpe.thermalcorrgfe: 0.253392 hartree
zpe.sumelectzpe: -921.462657 hartree
zpe.sumelectthermal: -921.446805 hartree
zpe.sumelectthermalent: -921.445861 hartree
zpe.sumelectthermalfe: -921.505380 hartree
dipole: -0.3626 -0.0707 0.0001
dipole: 0.3694
quadrupole: -114.3332 -115.3554 -148.4394
quadrupole: 0.3136 0.0003 0.0000
quadrupole: 11.7095 10.6872 -22.3967 0.3136 0.0003 0.0000
hfenergy: -921.7587719 hartree
pointgroup: C01 [X(C24H14)]
dipole: -0.1427328 0.0274624 -0.0000298 debye
polarizability: 552.5022082|-3.7978666|300.4657737|-0.0022614|-0.0000086|94.0741125 unknown
InChI: InChI=1S/C24H14/c1-2-7-16-13-22-21(12-15(16)6-1)20-11-5-10-19-18-9-4-3-8-17(18)14-23(22)24(19)20/h1-14H
charge 0 multiplicity 1
38 atoms
C  -1.013827 -0.748901 -0.000048
C  -0.495847 0.601279 -0.000056
C  0.979675 0.482608 -0.000071
C  0.047701 -1.70686 -0.000053
C  1.315306 -0.94083 -0.00009
C  -2.387696 -1.079952 -0.000064
C  -3.337309 0.035793 -0.00007
C  -1.389822 1.658999 -0.000079
C  -2.817777 1.393475 -0.000061
C  1.983616 1.445048 -0.000068
C  2.643932 -1.351938 -0.00011
C  -0.278232 -3.071347 -0.000055
C  3.363874 1.042586 -0.000092
C  3.69805 -0.373643 -0.000125
C  -2.695122 -2.47824 -0.00009
C  -1.660385 -3.435926 -0.000071
C  -4.749883 -0.153166 -0.000057
C  -3.742228 2.484667 -0.000082
C  4.426758 2.003345 -0.000092
C  5.079006 -0.755553 -0.000147
C  -5.633157 0.936975 -0.000071
C  -5.125715 2.267357 -0.000082
C  5.765039 1.598475 -0.000125
C  6.09377 0.206612 -0.000151
H  -1.055823 2.703507 -0.000115
H  1.744372 2.515292 -0.000053
H  2.909468 -2.415831 -0.000114
H  0.491248 -3.850873 -0.000063
H  -3.734357 -2.823691 -0.000101
H  -1.925182 -4.499522 -0.000082
H  -5.155696 -1.170372 -0.00004
H  -3.347128 3.507724 -0.000099
H  4.173573 3.070565 -0.000076
H  5.331675 -1.82293 -0.000175
H  -6.71507 0.765121 -0.000066
H  -5.817281 3.116815 -0.000095
H  6.566424 2.34542 -0.000134
H  7.144847 -0.102489 -0.000176
