program: Gaussian 09
title: 000005054
version: EM64L-G09RevD.01
frameworkgroup: C1[X(C6H6O2)]
method: RPBEPBE
basis: SDD
operation: Freq
keyword: #p
keyword: freq=noraman
keyword: PBEPBE/SDD
title: #p freq=noraman PBEPBE/SDD
converged: NO NO NO NO
title: Mulliken charges:
elementType: O O C C C C C C H H H H H H
charge: -0.437989 -0.439998 0.342815 0.348066 -0.514710 -0.380573 -0.425620 -0.145184 0.243651 0.252188 0.219701 0.226335 0.355457 0.355861
chargesum: 0.00000
title: Mulliken charges with hydrogens summed into heavy atoms:
elementType: O O C C C C C C
charge: -0.082532 -0.084138 0.342815 0.348066 -0.271059 -0.128384 -0.205919 0.081151
polarizability: 9.37067263e+01 -2.01055637e+00 8.16964611e+01 2.10628973e-03 -2.37430005e-03 2.94156301e+01
1716.lowfreq: -3.8990 -0.0009 -0.0006 -0.0006 1.2354 17.0734 213.4978 226.4256 309.1777
frequency: 213.4822 226.4101 309.1774 340.4605 365.2947 449.6670 450.5614 508.1357 523.1582 598.0337 676.0311 725.8274 762.3135 839.8781 850.2318 937.0480 953.0769 979.1490 1072.1736 1129.8611 1147.7054 1166.3403 1194.6977 1287.8789 1321.0278 1399.7692 1469.2998 1489.2110 1605.7792 1630.9018 3114.7447 3131.9137 3147.4454 3176.7827 3588.3724 3594.8824
redmass: 5.2135 4.0332 5.0829 1.1157 1.1172 3.5300 2.8454 7.2068 7.8174 4.5620 1.9963 7.6218 1.3913 1.6800 1.4449 3.3161 1.3065 6.1806 1.6388 1.5236 1.2670 1.0772 1.4783 2.9265 1.4979 6.1988 2.9581 2.7645 6.4381 6.1662 1.0890 1.0922 1.0921 1.0969 1.0660 1.0660
irintensity: 3.1071 2.7360 16.5287 62.8569 237.0201 8.9403 12.4998 2.1346 3.3763 1.2485 32.9164 3.7423 50.4691 53.6249 5.0100 82.1903 1.2501 0.9658 44.4382 295.8056 78.1636 3.2758 15.4103 47.5725 4.2616 6.9471 85.0554 38.1132 98.9301 129.9279 11.9502 6.4974 13.8310 5.7678 35.2358 35.7448
temp: 298.150 k
press: 1.00000 atm
elementType: 8 8 6 6 6 6 6 6 1 1 1 1 1 1
symmnumber: 1
zpe: 277394.4 jmol-1
zpe.correction: 0.105654 hartree
zpe.thermalcorrener: 0.112519 hartree
zpe.thermalcorrenthalpy: 0.113463 hartree
zpe.thermalcorrgfe: 0.075010 hartree
zpe.sumelectzpe: -382.091023 hartree
zpe.sumelectthermal: -382.084158 hartree
zpe.sumelectthermalent: -382.083214 hartree
zpe.sumelectthermalfe: -382.121667 hartree
dipole: -1.5915 0.1430 0.0006
dipole: 1.5979
quadrupole: -41.6846 -39.6264 -50.7751
quadrupole: -6.5803 0.0000 -0.0013
quadrupole: 2.3441 4.4023 -6.7464 -6.5803 0.0000 -0.0013
hfenergy: -382.1966771 hartree
pointgroup: C01 [X(C6H6O2)]
dipole: -0.6244239 -0.0729662 -0.0002225 debye
dipolederiv: -1.0711179 -0.5960076 0.0000783 -0.620153 -0.4616199 -0.0000138 0.0000606 -0.0000277 -0.4338851 -1.1416707 0.5200748 0.0000354 0.5935197 -0.3881395 0.0000389 0.0000495 0.0000298 -0.4330289 1.088501 0.4653519 -0.0000838 0.5780637 0.6582555 -0.0000428 -0.0000822 -0.0000415 0.1085489 1.1812456 -0.3497656 -0.0000125 -0.5217748 0.5290791 -0.000026 0.0000104 -0.0000298 0.1188415 -0.6083276 -0.0365548 0.0000144 -0.0064459 -0.0443686 -0.0000111 -0.0000085 -0.0000022 -0.2554831 -0.2095159 -0.0793733 0.000002 -0.3406657 -0.3236766 0.000024 0.0000205 0.0000191 -0.233103 -0.2725426 0.0400792 -0.0000024 0.3808861 -0.3222549 -0.0000033 -0.0000084 -0.0000016 -0.2715598 0.375828 0.0348541 -0.0000206 -0.00529 0.1623348 -0.0000027 -0.0000195 -0.000014 -0.105817 0.079836 -0.0309824 0.0000096 -0.0199108 -0.0771248 0.0000174 0.0000056 0.0000202 0.1947672 -0.0318366 0.0664084 0.0000088 0.0621311 0.0642173 -0.0000007 0.0000118 -0.000001 0.1885118 -0.1075038 -0.0775097 0.0000103 -0.0590889 0.0474936 0.000007 0.0000073 0.0000065 0.1913132 0.0895665 0.0015999 0.0000019 0.0066164 -0.1184172 0.0000076 0.0000004 0.0000065 0.1536396 0.315148 0.1658139 -0.0000245 0.1269984 0.1318127 0.0000381 0.0000013 0.0000508 0.388901 0.31239 -0.1239889 -0.0000169 -0.1748864 0.1424085 -0.0000326 -0.000049 -0.0000153 0.3883538 unknown
polarizability: 93.5908793|2.3281471|81.8123081|-0.0020422|-0.0024297|29.4156301 unknown
InChI: InChI=1S/C6H6O2/c7-5-2-1-3-6(8)4-5/h1-4,7-8H
charge 0 multiplicity 1
14 atoms
O  2.435277 1.023843 -0.000042
O  -2.420099 1.080817 0.000141
C  1.201574 0.359497 0.000055
C  -1.236564 0.328556 0.000157
C  -0.029397 1.059697 0.000073
C  1.236632 -1.055352 0.000107
C  -1.226623 -1.090524 0.000202
C  0.016455 -1.764235 0.000177
H  -0.069104 2.156344 0.000009
H  2.201044 -1.571025 0.000071
H  -2.167465 -1.6568 0.000242
H  0.034306 -2.859533 0.000201
H  2.313005 2.005119 -0.000205
H  -3.21234 0.489597 0.000013
