program: Gaussian 09
title: 000043222
version: EM64L-G09RevD.01
frameworkgroup: C1[X(C9H18O2)]
method: RPBEPBE
basis: SDD
operation: Freq
keyword: #pfreq=noraman
keyword: PBEPBE/SDD
title: #p freq=noraman PBEPBE/SDD
converged: YES YES NO NO
title: Mulliken charges:
elementType: O O C C C C C C C C C H H H H H H H H H H H H H H H H H H
charge: -0.418705 -0.236460 -0.405535 -0.389033 -0.389751 -0.032043 -0.133640 -0.716323 -0.714038 -0.714009 0.160632 0.228470 0.198037 0.199260 0.187812 0.218370 0.193789 0.196684 0.237052 0.211363 0.210676 0.211677 0.215305 0.208757 0.213305 0.223600 0.234535 0.227549 0.372666
chargesum: 0.00000
title: Mulliken charges with hydrogens summed into heavy atoms:
elementType: O O C C C C C C C C C
charge: -0.046039 -0.236460 0.020972 -0.001960 0.022408 0.164641 0.103412 -0.082608 -0.076672 -0.028326 0.160632
polarizability: 1.13865271e+02 7.94883130e-01 1.01563928e+02 -2.95321361e+00 -8.46128665e-01 9.31650266e+01
1716.lowfreq: -18.0371 -8.4190 0.0006 0.0007 0.0008 5.0574 14.3224 20.1770 47.8457
frequency: 13.0026 20.1069 47.7932 87.2197 107.6775 111.8113 200.6206 204.6423 216.5146 221.9967 236.4952 269.8259 290.5335 352.8494 362.5637 401.5184 480.9742 549.9751 577.7345 611.2200 714.6077 728.9531 757.3276 788.5871 836.2222 909.2169 915.9126 949.4749 956.0849 978.0728 985.7373 1030.4848 1036.3135 1046.8558 1077.4215 1107.4543 1133.7974 1157.4265 1192.4417 1194.9358 1241.3018 1246.9782 1274.6915 1285.0662 1293.6707 1319.9781 1335.2600 1342.8950 1361.4957 1363.2832 1372.8123 1386.8609 1390.3378 1454.0327 1457.5691 1463.9936 1473.4780 1476.7305 1477.9030 1481.8035 1482.7946 1489.7036 1661.9539 2944.7362 2962.9183 2968.9010 2971.2733 2974.4304 2979.6355 2986.7345 2999.5826 3013.2380 3027.7503 3052.4140 3063.6798 3064.6106 3068.5739 3072.0706 3088.2784 3093.2044 3505.5279
redmass: 3.0031 8.5701 3.6132 3.2669 1.8250 2.3726 1.7032 1.6188 1.7101 1.4049 1.0720 3.0590 3.3528 2.0099 2.2689 3.0531 3.4168 2.4283 3.2478 1.2528 2.7502 1.6054 1.9511 3.0003 1.4184 1.2476 1.7887 1.3815 1.8068 2.2475 1.7344 1.9747 2.1975 2.1407 2.1851 1.5361 2.0228 2.1984 1.8901 1.5091 1.4980 1.3939 1.2422 1.3497 1.1007 1.5182 1.4578 1.4059 1.6123 1.4836 1.2183 1.2490 1.2219 1.0780 1.0741 1.0455 1.0484 1.0576 1.0874 1.0654 1.0495 1.0561 8.0878 1.0665 1.0724 1.0353 1.0567 1.0420 1.0602 1.0349 1.0976 1.0874 1.0974 1.1037 1.1000 1.0997 1.0992 1.0985 1.1004 1.1007 1.0638
irintensity: 0.1902 1.6391 0.3725 0.1770 0.0067 0.1986 0.0856 0.2801 0.1394 0.0293 0.1354 2.6598 1.7836 0.0136 1.1280 1.3408 21.5553 14.2003 7.6951 115.7777 31.3265 22.1710 0.3289 1.1389 0.3868 2.2605 0.7833 0.4070 2.2752 11.7352 4.8763 82.4175 211.5397 5.2164 2.3314 9.4143 4.4203 7.9095 5.2661 3.5604 8.6045 9.1577 3.8282 5.3499 1.4134 0.9917 3.9398 0.9445 14.8521 3.0552 22.1308 24.0041 9.4129 3.5559 2.6042 2.0836 13.3212 4.2167 4.7091 12.8006 24.4465 16.5528 185.9140 15.1545 55.5571 41.7392 5.9837 9.0255 57.9312 35.6938 14.4929 7.9742 9.3496 62.6160 24.6497 13.6807 69.9564 102.8787 33.7613 28.0706 17.6609
temp: 298.150 k
press: 1.00000 atm
elementType: 8 8 6 6 6 6 6 6 6 6 6 1 1 1 1 1 1 1 1 1 1 1 1 1 1 1 1 1 1
symmnumber: 1
zpe: 668919.2 jmol-1
zpe.correction: 0.254778 hartree
zpe.thermalcorrener: 0.268927 hartree
zpe.thermalcorrenthalpy: 0.269871 hartree
zpe.thermalcorrgfe: 0.211433 hartree
zpe.sumelectzpe: -503.303741 hartree
zpe.sumelectthermal: -503.289591 hartree
zpe.sumelectthermalent: -503.288647 hartree
zpe.sumelectthermalfe: -503.347086 hartree
dipole: -0.1732 -0.9626 1.0390
dipole: 1.4270
quadrupole: -66.2078 -66.3227 -73.8177
quadrupole: -0.6284 -2.2903 3.2764
quadrupole: 2.5749 2.4600 -5.0350 -0.6284 -2.2903 3.2764
hfenergy: -503.5585185 hartree
pointgroup: C01 [X(C9H18O2)]
dipole: 0.0744336 -0.3516215 -0.4312749 debye
polarizability: 113.9791335|-0.7658034|101.4302663|-2.5007502|1.4067878|93.1848254 unknown
InChI: InChI=1S/C9H18O2/c1-7(2)5-4-6-8(3)9(10)11/h7-8,10H,4-6H2,1-3H3
charge 0 multiplicity 1
29 atoms
O  3.008784 1.375602 -0.950346
O  2.064229 1.322548 1.166839
C  -0.660187 -0.312019 -0.107194
C  -1.955762 -0.778809 0.59701
C  0.578146 -1.096531 0.383042
C  -3.266465 -0.068573 0.150811
C  1.899054 -0.676834 -0.304427
C  -3.605731 -0.33818 -1.335784
C  -3.241726 1.451195 0.446252
C  3.07572 -1.623382 0.074258
C  2.288286 0.744459 0.080244
H  -0.50194 0.767273 0.082461
H  -0.759195 -0.437675 -1.204325
H  -1.831191 -0.63659 1.690939
H  -2.074801 -1.871469 0.435669
H  0.689416 -0.964023 1.477209
H  0.423863 -2.1793 0.201092
H  -4.082782 -0.511078 0.761431
H  1.777034 -0.69772 -1.403932
H  -4.598452 0.07594 -1.593331
H  -3.622208 -1.422934 -1.553696
H  -2.865914 0.132892 -2.00946
H  -2.990878 1.649284 1.505264
H  -4.22693 1.908246 0.236974
H  -2.494294 1.971674 -0.180978
H  2.837581 -2.654467 -0.24196
H  4.014127 -1.3167 -0.41964
H  3.236843 -1.625923 1.167361
H  3.283671 2.283093 -0.644682
