program: Gaussian 09
title: 000005087
version: EM64L-G09RevD.01
frameworkgroup: C1[X(C15H22N2O3)]
method: RPBEPBE
basis: SDD
operation: Freq
keyword: #p
keyword: freq=noraman
keyword: PBEPBE/SDD
title: #p freq=noraman PBEPBE/SDD
converged: YES YES NO NO
title: Mulliken charges:
elementType: O O O N N C C C C C C C C C C C C C C C H H H H H H H H H H H H H H H H H H H H H H
charge: -0.287838 -0.272552 -0.281933 -0.404573 -0.375501 -0.075460 -0.585447 -0.398597 0.548860 0.174798 -0.568685 -0.447938 0.233311 0.197958 -0.337879 -0.371459 -0.262760 -0.343012 -0.687054 -0.536067 0.246144 0.205721 0.229848 0.227612 0.223636 0.338331 0.316912 0.276827 0.229351 0.236525 0.206118 0.208080 0.231963 0.189492 0.193377 0.191701 0.212596 0.213004 0.214597 0.220547 0.244015 0.225433
chargesum: 0.00000
title: Mulliken charges with hydrogens summed into heavy atoms:
elementType: O O O N N C C C C C C C C C C C C C C C
charge: -0.287838 -0.272552 -0.281933 -0.066242 -0.058589 0.170683 -0.149877 0.052651 0.548860 0.174798 -0.291859 -0.218587 0.233311 0.197958 -0.101354 0.042739 0.158695 0.042066 -0.046857 0.153928
polarizability: 2.42950425e+02 -1.19937457e+00 2.03820635e+02 -2.31985082e+01 -2.20232834e+00 1.26245135e+02
1716.lowfreq: -2.9013 -0.0010 -0.0009 -0.0005 5.6158 7.1884 15.9837 24.0053 30.9276
frequency: 14.8999 23.8679 30.9211 35.0540 56.1237 66.1540 84.8395 95.4273 103.3985 109.8121 142.7247 161.1123 177.6635 207.1394 236.2886 239.2717 249.4019 259.8665 278.5138 318.3072 349.5696 362.9474 420.8204 432.0126 452.3605 461.8771 469.1198 511.1762 515.9822 527.5832 603.1404 634.2826 669.1849 707.6011 713.5178 721.8166 731.2462 742.6032 760.8155 798.2593 805.5376 840.1915 877.8628 902.5075 911.0104 921.1085 927.1923 936.3213 948.5913 979.0428 985.0195 991.0349 1036.5707 1039.8481 1077.6525 1086.5205 1109.2762 1110.0423 1114.4907 1127.7323 1141.5469 1146.0445 1170.4969 1174.1251 1204.3855 1206.2748 1211.5167 1228.7408 1254.9120 1258.2486 1269.5872 1273.5112 1280.1883 1286.6243 1298.6334 1332.8219 1343.9561 1346.7995 1367.4180 1377.4858 1379.5403 1389.9666 1399.4310 1416.3089 1436.0423 1464.8998 1466.4322 1470.2262 1473.5536 1474.3296 1477.8057 1484.4887 1492.1860 1496.0223 1498.9079 1577.4926 1613.2497 1692.5762 2957.9761 2960.4679 2965.6797 2973.1329 2975.7365 2982.4312 2993.0032 3009.1213 3011.3558 3035.2142 3046.3130 3049.1349 3051.1461 3070.8773 3074.8910 3078.7560 3122.4023 3124.1611 3145.9029 3159.5537 3600.5240 3621.7708
redmass: 4.9830 2.1074 5.0178 3.0221 3.9890 4.3891 4.4172 3.1315 1.9879 3.0817 4.1390 4.7672 3.5935 3.9113 1.1741 3.3110 1.1997 3.3992 3.9323 3.9752 3.1325 3.8573 2.9909 1.5592 3.0561 2.3200 3.1622 1.2569 3.4267 4.6681 5.1915 4.5119 6.1770 11.6411 4.5520 5.3988 4.1392 1.0748 3.5117 1.6807 1.1323 2.3119 4.1001 1.6437 1.7297 1.6245 1.6579 1.1571 4.2209 3.6386 5.4115 2.4277 2.0527 3.4038 2.0054 2.2097 2.6781 1.2597 2.5409 2.4132 1.4285 1.5428 1.1299 1.4658 1.4866 1.5380 1.4901 1.3887 2.3894 2.7157 1.4135 1.1934 1.5142 1.0788 1.6510 1.2761 1.4310 1.4347 1.5710 1.9712 5.6874 1.2174 1.9590 2.7487 1.2121 1.1114 1.0509 1.0760 1.1157 1.0661 1.0426 1.0795 1.2017 2.0314 1.1096 7.3461 6.7337 7.4037 1.0659 1.0327 1.0588 1.0631 1.0365 1.0606 1.0594 1.1002 1.0867 1.0992 1.0997 1.1041 1.1015 1.1011 1.0995 1.1030 1.0934 1.0950 1.0916 1.0939 1.0790 1.0797
irintensity: 1.7085 0.1415 2.3833 2.8701 1.7361 0.1904 2.6308 0.9356 1.3097 5.1636 0.6064 5.6666 2.2299 2.0791 0.2401 0.7180 0.2116 3.5061 7.5853 0.7424 1.3107 2.1607 4.1817 32.7602 14.4962 28.3074 26.6346 219.6906 21.5693 5.9555 7.7235 4.5754 14.5991 27.1703 15.3697 2.3866 8.4672 8.8001 18.7316 27.1849 0.5487 4.7881 17.1380 15.2479 5.9281 8.3732 7.7933 0.4866 2.7986 42.3237 48.6069 23.4979 44.2980 29.6860 2.6403 10.9565 60.2434 0.2670 66.9061 43.9141 2.8252 16.6803 7.6009 13.7633 63.5437 17.4495 21.8595 34.7902 285.1888 44.3603 32.8484 4.4326 68.8660 0.1251 25.3537 6.3258 7.3408 15.2032 26.6097 32.0317 24.7395 5.4077 70.7049 23.6496 12.7344 8.7501 13.6168 2.4623 76.7850 0.6077 12.2878 18.6369 27.2424 117.0667 9.4158 32.0584 11.6611 535.0886 72.9606 71.3259 24.3978 41.3615 39.0664 34.5559 42.5443 8.5688 27.0117 40.4254 7.3060 46.2185 31.0382 8.6276 54.3859 113.3112 33.2462 1.7215 5.2602 13.7789 43.7098 38.5043
temp: 298.150 k
press: 1.00000 atm
elementType: 8 8 8 7 7 6 6 6 6 6 6 6 6 6 6 6 6 6 6 6 1 1 1 1 1 1 1 1 1 1 1 1 1 1 1 1 1 1 1 1 1 1
symmnumber: 1
zpe: 921666.4 jmol-1
zpe.correction: 0.351044 hartree
zpe.thermalcorrener: 0.372225 hartree
zpe.thermalcorrenthalpy: 0.373169 hartree
zpe.thermalcorrgfe: 0.297499 hartree
zpe.sumelectzpe: -918.432047 hartree
zpe.sumelectthermal: -918.410866 hartree
zpe.sumelectthermalent: -918.409921 hartree
zpe.sumelectthermalfe: -918.485592 hartree
dipole: -0.8732 6.5783 -2.5865
dipole: 7.1223
quadrupole: -95.7569 -119.7043 -123.5951
quadrupole: 8.5383 -12.0519 10.7004
quadrupole: 17.2619 -6.6855 -10.5764 8.5383 -12.0519 10.7004
hfenergy: -918.7830908 hartree
pointgroup: C01 [X(C15H22N2O3)]
dipole: 0.5148834 -2.542071 -1.0604726 debye
polarizability: 243.1388756|1.139014|203.7002929|22.4810091|5.0081466|126.177027 unknown
InChI: InChI=1S/C15H22N2O3/c1-3-4-7-20-14-9-11(5-6-13(14)19-2)8-12-10-16-15(18)17-12/h5-6,9,12,16-17H,3-4,7-8,10H2,1-2H3
charge 0 multiplicity 1
42 atoms
O  1.930753 0.681436 0.196383
O  -3.835978 2.754905 1.231667
O  2.744144 -2.038089 0.597622
N  -3.214067 0.475744 0.87042
N  -5.003266 1.265845 -0.220727
C  -3.563983 -0.609058 -0.064127
C  -2.57267 -0.725024 -1.26591
C  -5.002865 -0.174192 -0.515768
C  -1.164309 -1.093438 -0.829633
C  -3.997131 1.627619 0.690943
C  -0.199954 -0.092131 -0.553723
C  -0.788258 -2.447068 -0.654485
C  1.10066 -0.408302 -0.102228
C  1.454237 -1.780518 0.095262
C  0.504765 -2.787292 -0.199555
C  3.885396 2.083873 -0.068795
C  3.356152 0.658312 -0.238078
C  5.376808 2.195432 -0.463275
C  5.927583 3.627069 -0.285842
C  3.1031 -3.435206 0.850657
H  -3.59813 -1.581766 0.460428
H  -2.971368 -1.496986 -1.953548
H  -2.580286 0.239917 -1.807489
H  -5.775969 -0.717118 0.066005
H  -5.161456 -0.379897 -1.589893
H  -2.310197 0.53404 1.336639
H  -5.79417 1.884294 -0.382267
H  -0.433483 0.968606 -0.69798
H  -1.504451 -3.246521 -0.879545
H  0.763948 -3.842134 -0.067045
H  3.278123 2.775902 -0.683414
H  3.75166 2.390678 0.986658
H  3.916152 -0.064699 0.379424
H  3.403322 0.334947 -1.298421
H  5.974642 1.490437 0.149817
H  5.505303 1.878448 -1.518659
H  5.364237 4.347733 -0.907758
H  5.84286 3.955683 0.766828
H  6.992544 3.689046 -0.575728
H  3.090808 -4.031928 -0.082265
H  4.12611 -3.398802 1.253351
H  2.425084 -3.894896 1.595656
