program: Gaussian 09
title: 000043253
version: EM64L-G09RevD.01
frameworkgroup: C1[X(C18H19Cl3)]
method: RPBEPBE
basis: SDD
operation: Freq
keyword: #p
keyword: freq=noraman
keyword: PBEPBE/SDD
title: #p freq=noraman PBEPBE/SDD
converged: YES YES NO NO
title: Mulliken charges:
elementType: Cl Cl Cl C C C C C C C C C C C C C C C C C C H H H H H H H H H H H H H H H H H H H
charge: 0.085650 0.090886 0.106046 -0.348576 0.570851 0.546523 -0.659766 -0.561537 -0.631742 -0.455517 -0.391091 0.336459 0.336706 0.327343 0.324000 -0.425529 -0.441220 -0.819852 -0.818984 -0.809638 -0.810793 0.275048 0.258175 0.230485 0.238323 0.255316 0.230721 0.229907 0.233364 0.226195 0.224084 0.231506 0.226285 0.225978 0.225269 0.227627 0.229344 0.226615 0.230191 0.225346
chargesum: 0.00000
title: Mulliken charges with hydrogens summed into heavy atoms:
elementType: Cl Cl Cl C C C C C C C C C C C C C C C C C C
charge: 0.085650 0.090886 0.106046 -0.073528 0.570851 0.546523 -0.659766 -0.303362 -0.401257 -0.217194 -0.135775 0.336459 0.336706 0.327343 0.324000 -0.194808 -0.211312 -0.136209 -0.135215 -0.127398 -0.128642
polarizability: 2.72438150e+02 3.15752052e+00 1.99804861e+02 1.10811029e+01 -1.14324319e+01 2.05642341e+02
1716.lowfreq: -10.2595 -2.3371 -0.0026 -0.0010 -0.0005 5.0162 22.2748 28.9710 42.7375
frequency: 22.2526 28.9180 42.6736 50.8941 60.4355 101.3158 117.9888 120.9741 139.5504 146.2441 165.9069 168.6760 179.8424 182.4437 193.4703 208.3506 217.2744 230.0574 266.9191 277.0082 290.8960 291.6693 318.5154 330.5877 362.3508 410.3076 437.7204 442.3292 443.4546 498.5278 499.6728 545.4781 552.5886 576.5350 607.3571 614.5236 685.7818 690.6280 721.5052 735.6990 739.7458 743.6362 787.2352 812.0568 832.7132 842.5608 893.1576 898.7821 910.1447 947.3352 949.8084 969.6246 988.5565 992.9979 995.7212 1005.4986 1029.7652 1030.3153 1033.5785 1053.2773 1053.5402 1131.5880 1133.2158 1154.5487 1177.9461 1208.3751 1220.0214 1242.0204 1251.2877 1259.2136 1293.0722 1299.6226 1313.0997 1375.7192 1377.8847 1392.1263 1393.2675 1403.7578 1405.2697 1410.3172 1413.7589 1462.0385 1462.5873 1468.9897 1469.9984 1475.9043 1476.0539 1476.9553 1477.3737 1498.1957 1501.7648 1582.2705 1584.6137 1621.5345 1623.6102 2967.8221 2968.3980 2970.0194 2970.2640 2999.0942 3038.8893 3039.2471 3043.0160 3043.5422 3082.4925 3082.7368 3085.0817 3086.6333 3107.7234 3118.3564 3122.1026 3140.7237 3145.0656 3165.2045
redmass: 3.9658 4.3102 4.1898 9.4221 5.6024 6.3723 1.1596 1.1300 2.7501 2.3785 1.2418 1.1981 8.0607 7.7406 7.1459 3.0212 3.1108 3.4202 17.7629 15.1082 2.6121 2.5953 4.0895 5.1987 8.4369 3.0842 2.9111 2.8167 2.8426 4.8222 4.7522 4.7125 3.9898 5.2454 5.3125 4.4390 6.3220 7.3096 3.1988 3.5289 3.4292 3.8819 2.8815 4.4005 1.6303 1.4090 1.4423 1.5258 3.5769 2.2155 1.4804 1.3525 1.7100 1.6089 1.5944 1.6210 1.7066 1.4543 2.5807 1.6509 1.6471 2.2224 2.2466 1.7128 1.5760 1.7108 1.8890 1.5548 3.2854 3.0153 1.3932 1.4898 1.4644 4.5361 4.1594 1.2399 1.2394 1.3314 1.3017 2.2548 2.2386 1.0469 1.0473 1.1971 1.1577 1.0537 1.0483 1.1523 1.1729 2.3760 2.4297 6.4732 6.1216 6.2975 6.3489 1.0376 1.0374 1.0383 1.0380 1.0820 1.0969 1.0969 1.0967 1.0968 1.0985 1.0985 1.0978 1.0976 1.0910 1.0872 1.0894 1.0940 1.0938 1.0939
irintensity: 0.1481 0.0269 0.3979 0.0220 0.0701 0.2319 0.0208 0.1294 1.5075 0.7492 1.2648 0.8507 0.1912 0.9047 0.7022 0.8490 0.9650 2.3526 0.2444 1.7422 0.0287 0.0263 1.3712 2.0468 3.6768 2.2981 0.4731 4.2095 3.6197 10.4202 9.1281 4.1261 1.4393 30.1183 61.7274 14.2947 74.8735 111.8196 4.9217 8.0169 20.9659 19.8900 7.8436 17.8155 13.3802 26.6060 5.2860 2.6488 8.0479 0.7100 0.9542 1.7619 2.2224 2.8843 5.8426 23.5140 2.0223 12.9165 48.3705 0.0425 0.0260 7.7977 9.7369 4.0485 4.1196 3.4945 0.6769 4.1940 2.6158 1.9248 0.5972 2.8305 8.5861 1.3774 1.7597 6.7649 5.8129 21.4043 13.5638 2.0986 1.8738 0.1459 0.1197 21.6482 29.2047 23.5504 32.8040 1.5497 1.4814 35.5400 34.4546 4.1771 1.8942 5.1464 2.8678 63.1233 60.1707 10.2634 22.4255 5.2227 34.6633 43.7576 0.2673 3.5344 28.4798 36.2591 4.6746 10.3386 16.8907 15.4420 17.1799 21.7455 1.9105 3.3944
temp: 298.150 k
press: 1.00000 atm
elementType: 17 17 17 6 6 6 6 6 6 6 6 6 6 6 6 6 6 6 6 6 6 1 1 1 1 1 1 1 1 1 1 1 1 1 1 1 1 1 1 1
symmnumber: 1
zpe: 823639.6 jmol-1
zpe.correction: 0.313708 hartree
zpe.thermalcorrener: 0.336000 hartree
zpe.thermalcorrenthalpy: 0.336944 hartree
zpe.thermalcorrgfe: 0.261033 hartree
zpe.sumelectzpe: -2075.972310 hartree
zpe.sumelectthermal: -2075.950018 hartree
zpe.sumelectthermalent: -2075.949074 hartree
zpe.sumelectthermalfe: -2076.024984 hartree
dipole: 0.5199 -3.8141 -0.5804
dipole: 3.8928
quadrupole: -131.3514 -149.4475 -136.4523
quadrupole: 0.8778 0.5485 -2.6493
quadrupole: 7.7323 -10.3638 2.6314 0.8778 0.5485 -2.6493
hfenergy: -2076.2860177 hartree
pointgroup: C01 [X(C18H19Cl3)]
dipole: -0.1280074 1.5257114 0.0387616 debye
polarizability: 272.227471|1.4706507|195.7609257|-11.4088739|10.2153017|209.8969553 unknown
InChI: InChI=1S/C18H19Cl3/c1-11-5-7-15(9-13(11)3)17(18(19,20)21)16-8-6-12(2)14(4)10-16/h5-10,17H,1-4H3
charge 0 multiplicity 1
40 atoms
Cl 0.718398 -2.906178 1.354941
Cl 1.447773 -3.389552 -1.521016
Cl -1.440065 -3.539049 -0.67664
C  -0.018086 -1.101139 -0.777796
C  1.260374 -0.271715 -0.556849
C  -1.269737 -0.416772 -0.203383
C  0.157321 -2.601148 -0.403296
C  1.562105 0.322752 0.692563
C  -1.978577 0.452212 -1.070816
C  2.14887 -0.058283 -1.636822
C  -1.724669 -0.54324 1.130276
C  2.727978 1.098562 0.887791
C  -3.109597 1.188783 -0.649987
C  3.62478 1.302813 -0.206366
C  -3.562223 1.053381 0.69809
C  3.312645 0.719292 -1.45757
C  -2.856845 0.18205 1.561372
C  3.014404 1.71304 2.246443
C  -3.830668 2.104516 -1.622686
C  4.883696 2.133502 -0.036956
C  -4.774699 1.819376 1.19542
H  -0.174095 -1.154175 -1.874015
H  0.871374 0.193324 1.532104
H  -1.637014 0.562797 -2.108626
H  1.936943 -0.504364 -2.615371
H  -1.221872 -1.216621 1.829928
H  3.991854 0.876337 -2.303926
H  -3.202654 0.065114 2.595649
H  2.21934 1.469901 2.971222
H  3.973805 1.34962 2.663144
H  3.092579 2.81597 2.186958
H  -3.352858 2.090802 -2.616886
H  -4.889442 1.807721 -1.752214
H  -3.837334 3.152374 -1.265068
H  4.650542 3.165152 0.290514
H  5.554693 1.702321 0.731118
H  5.450086 2.198533 -0.98147
H  -5.68334 1.56528 0.615841
H  -4.979131 1.597587 2.256609
H  -4.633753 2.913425 1.098776
