program: Gaussian 09
title: 000043247
version: EM64L-G09RevD.01
frameworkgroup: C1[X(C15H17NO5)]
method: RPBEPBE
basis: SDD
operation: Freq
keyword: #p
keyword: freq=noraman
keyword: PBEPBE/SDD
title: #p freq=noraman PBEPBE/SDD
converged: YES YES NO NO
title: Mulliken charges:
elementType: O O O O O N C C C C C C C C C C C C C C C H H H H H H H H H H H H H H H H H
charge: -0.309453 -0.290150 -0.302689 -0.244852 -0.289267 -0.390759 0.392155 0.047494 0.236704 0.293388 -0.511937 -0.562838 -0.491977 0.171870 0.379024 -0.404187 -0.257090 -0.170621 -0.524586 -0.523760 -0.526643 0.234954 0.298185 0.269976 0.241627 0.319092 0.269039 0.252763 0.257381 0.234037 0.260054 0.228255 0.263765 0.214257 0.230492 0.225088 0.249166 0.232042
chargesum: 0.00000
title: Mulliken charges with hydrogens summed into heavy atoms:
elementType: O O O O O N C C C C C C C C C C C C C C C
charge: -0.309453 -0.290150 -0.302689 -0.244852 -0.289267 -0.071667 0.392155 0.047494 0.236704 0.293388 -0.276983 -0.264652 0.019625 0.171870 0.379024 -0.135148 -0.004326 0.086760 0.197760 0.184754 0.179653
polarizability: 2.52489692e+02 -9.06312877e-01 1.94409521e+02 1.02502196e+00 -1.65300911e+00 1.29120928e+02
1716.lowfreq: -5.8350 -0.0008 -0.0004 0.0005 2.9514 3.3641 8.7763 24.8606 30.0373
frequency: 8.0201 24.8422 29.7879 41.5060 63.0542 65.3442 76.8361 92.7329 106.8675 117.2134 148.1725 154.0962 158.6426 167.1034 203.5692 212.0146 232.7795 247.4791 259.5663 285.8848 315.7642 325.4961 358.0865 370.8158 422.0182 439.9929 515.8558 519.8741 545.8346 586.1632 594.3292 604.0236 621.6194 647.6471 664.9385 715.1648 726.5295 740.9741 763.1222 774.9576 825.3433 855.9808 863.9576 871.3909 876.4873 880.2393 887.3515 927.4451 937.9889 948.4253 984.2659 1020.7089 1033.7566 1037.9400 1047.6838 1094.4104 1110.2794 1112.7864 1114.1643 1132.4256 1147.5814 1152.8361 1158.7416 1171.6273 1176.5266 1200.8841 1219.3476 1240.9294 1266.9777 1301.9589 1348.7705 1360.5757 1363.9251 1390.7592 1415.9813 1434.1426 1436.9200 1441.6196 1451.6439 1458.1480 1458.4356 1462.1628 1476.5818 1483.4515 1485.6641 1487.6096 1495.4600 1558.8232 1594.0987 1597.6139 1604.0754 2973.5786 2976.8416 2982.1219 3004.7815 3070.6176 3083.9647 3085.7382 3088.8559 3122.4556 3125.0029 3129.6639 3148.0370 3177.0741 3219.9789 3235.4375 3267.1191 3568.5692
redmass: 4.8630 5.7479 4.4690 6.5307 3.8320 2.5766 2.9827 2.8945 3.3803 2.7007 1.1683 1.4192 1.2332 3.5474 3.3232 4.0008 5.6352 5.6815 7.1068 5.5878 3.0370 2.6649 5.9790 5.8588 6.3352 5.2031 3.7088 6.2475 1.7795 3.1576 3.1649 3.7225 4.7291 4.5156 5.5435 3.5502 1.3718 4.3850 4.0879 4.9551 1.3561 3.9822 3.1851 6.3232 2.4068 1.5210 3.7358 1.5384 8.5481 3.3809 3.3924 1.6979 3.8364 4.0802 3.8610 2.5900 1.2432 1.2372 1.2400 1.5360 1.4244 1.3649 1.4563 3.2440 2.0709 1.6143 1.8177 1.7981 1.3868 4.4218 1.4122 6.6943 2.3220 2.8347 1.3328 1.2980 1.3200 1.2195 1.4585 1.0652 1.1361 1.1911 1.0571 1.0547 1.0753 4.7813 2.0832 7.6290 7.2512 7.2141 6.8225 1.0308 1.0341 1.0295 1.0644 1.1042 1.1050 1.0983 1.0973 1.1026 1.1037 1.1047 1.0912 1.0921 1.0917 1.0995 1.1085 1.0775
irintensity: 0.2289 2.1786 0.3651 6.2026 1.2686 1.0454 3.5435 9.3517 2.0151 5.1696 1.5972 3.4395 0.9719 2.5538 3.3485 3.1917 1.1101 19.9099 0.5373 14.6617 9.1822 5.0825 1.7671 3.2852 9.6416 31.5103 17.9170 0.7369 58.8812 19.3457 5.8386 17.6046 13.9477 5.8382 9.1544 3.9716 88.2062 23.2631 21.9802 6.1621 30.4637 22.6401 12.0379 1.0573 16.8569 4.7362 15.3342 14.6164 76.4542 35.0012 43.7178 26.2634 55.5701 148.6378 21.6962 9.6282 10.7682 10.0997 2.5057 16.1353 10.4843 5.8435 16.1393 91.4894 27.9941 12.9527 14.3679 23.9022 36.7022 386.7050 24.0800 15.1224 12.4355 38.8171 15.9186 24.4845 20.5472 70.0284 117.0466 22.5612 17.8714 26.6676 5.4603 24.7495 49.0790 7.4832 197.6290 204.8751 22.9527 24.6377 4.2687 63.4215 92.3693 61.4865 36.7286 26.4125 17.1550 34.5161 7.6135 23.3201 21.9767 13.8828 5.6545 4.4932 4.2743 0.0066 0.7004 14.3595
temp: 298.150 k
press: 1.00000 atm
elementType: 8 8 8 8 8 7 6 6 6 6 6 6 6 6 6 6 6 6 6 6 6 1 1 1 1 1 1 1 1 1 1 1 1 1 1 1 1 1
symmnumber: 1
zpe: 775272.6 jmol-1
zpe.correction: 0.295286 hartree
zpe.thermalcorrener: 0.316951 hartree
zpe.thermalcorrenthalpy: 0.317895 hartree
zpe.thermalcorrgfe: 0.240702 hartree
zpe.sumelectzpe: -1011.039481 hartree
zpe.sumelectthermal: -1011.017816 hartree
zpe.sumelectthermalent: -1011.016872 hartree
zpe.sumelectthermalfe: -1011.094065 hartree
dipole: 1.5884 2.6298 2.9126
dipole: 4.2334
quadrupole: -96.3092 -124.5983 -118.6499
quadrupole: -2.4996 -0.9911 -3.4046
quadrupole: 16.8766 -11.4125 -5.4641 -2.4996 -0.9911 -3.4046
hfenergy: -1011.3347672 hartree
pointgroup: C01 [X(C15H17N1O5)]
dipole: 0.5988757 -0.6565437 -1.408673 debye
polarizability: 252.1260021|3.7081209|190.4298057|-5.3047604|15.8112003|133.4643327 unknown
InChI: InChI=1S/C15H17NO5/c1-18-12-7-10(8-13(19-2)14(12)20-3)15(17)16-9-11-5-4-6-21-11/h4-8,16H,9H2,1-3H3
charge 0 multiplicity 1
38 atoms
O  4.270443 -0.339368 -0.646787
O  2.449022 -2.581213 -0.435402
O  3.282543 2.28132 0.057014
O  -4.80366 -1.37991 -0.365129
O  -1.432501 1.546116 1.785308
N  -2.068853 -0.549591 1.008421
C  0.257839 0.199661 0.6725
C  2.929222 -0.144276 -0.24581
C  2.046342 -1.259656 -0.176431
C  2.437168 1.14921 0.09851
C  0.722571 -1.080835 0.284258
C  1.12364 1.314688 0.570905
C  -3.46294 -0.396077 1.471405
C  -1.131957 0.457354 1.198066
C  -4.447375 -0.210752 0.356138
C  -5.10987 0.876873 -0.187427
C  -5.916719 0.388397 -1.289021
C  -5.705119 -0.976432 -1.368388
C  5.263476 -0.089481 0.431332
C  3.122941 -2.846717 -1.726588
C  3.775619 2.645808 -1.291848
H  0.1123 -1.985805 0.371543
H  0.766624 2.304748 0.867086
H  -3.474447 0.497028 2.117828
H  -3.743101 -1.276449 2.079873
H  -1.843285 -1.362414 0.434656
H  -5.02378 1.905821 0.156117
H  -6.567421 0.976834 -1.932858
H  -6.079843 -1.767694 -2.011483
H  5.111143 -0.81009 1.255273
H  5.172937 0.945245 0.80576
H  6.247295 -0.248824 -0.0355
H  4.04558 -2.251422 -1.818065
H  2.437152 -2.619844 -2.565672
H  3.350157 -3.923409 -1.710758
H  2.925653 2.926786 -1.941938
H  4.340463 1.81227 -1.746594
H  4.430537 3.516398 -1.136094
