program: Gaussian 09
title: 000043233
version: EM64L-G09RevD.01
frameworkgroup: C1[X(C12H11Cl2N3O2)]
method: RPBEPBE
basis: SDD
operation: Freq
keyword: #p
keyword: freq=noraman
keyword: PBEPBE/SDD
title: #p freq=noraman PBEPBE/SDD
converged: YES YES NO NO
title: Mulliken charges:
elementType: Cl Cl O O N N N C C C C C C C C C C C C H H H H H H H H H H H
charge: -0.028915 -0.033476 -0.264252 -0.294184 -0.111970 -0.039861 -0.120040 0.203649 -0.442010 0.540893 -0.322353 -0.315547 -0.320474 -0.356895 -0.209090 -0.212320 -0.149811 -0.107595 -0.295858 0.260539 0.274280 0.225519 0.244652 0.240476 0.235340 0.296307 0.284564 0.263204 0.291845 0.263384
chargesum: 0.00000
title: Mulliken charges with hydrogens summed into heavy atoms:
elementType: Cl Cl O O N N N C C C C C C C C C C C C
charge: -0.028915 -0.033476 -0.264252 -0.294184 -0.111970 -0.039861 -0.120040 0.203649 0.092809 0.540893 0.147817 0.160268 -0.320474 -0.060587 0.075474 0.050885 0.142034 -0.107595 -0.032474
polarizability: 2.40944882e+02 1.76055660e+00 1.51955506e+02 1.13708024e+01 1.50300303e+01 1.11936925e+02
1716.lowfreq: -8.4185 -6.4989 -0.0008 0.0008 0.0016 3.8959 20.8454 33.2194 40.3829
frequency: 20.5561 33.1956 40.3771 57.3931 83.1452 104.6362 136.1171 150.8870 164.5625 181.7348 197.7895 249.8377 266.2367 294.0220 305.2038 357.8967 363.6362 376.0458 449.6767 477.5874 485.3518 553.2610 609.3251 617.3469 649.9774 652.2472 667.5366 691.7297 720.2409 748.9925 767.1391 795.4121 814.4802 839.4684 842.2933 863.8518 867.1125 913.0266 915.1583 939.1093 949.4253 974.2080 978.6373 997.9100 1010.3407 1040.5795 1085.3656 1093.0197 1109.3243 1127.3126 1144.1272 1152.2459 1166.8739 1182.1253 1196.3792 1212.8403 1237.3124 1251.7017 1291.2466 1317.5623 1327.1552 1329.1663 1349.5508 1358.2766 1374.1732 1384.8800 1426.1845 1450.4575 1451.5559 1469.2416 1480.1499 1563.5931 1589.2402 3005.8299 3019.8495 3046.5536 3102.7255 3116.4737 3119.9125 3167.0365 3182.4929 3185.1559 3252.5160 3263.7295
redmass: 6.0943 7.6903 5.3639 4.7186 4.6344 7.0698 6.5374 5.9899 6.4760 15.6290 3.0108 7.8665 8.5944 4.8408 7.0537 3.3641 2.7873 9.3703 3.6826 8.1204 5.7644 4.9442 4.5445 2.3961 6.1724 5.2321 3.3214 6.8548 4.8257 6.6927 5.8825 2.9195 1.4909 1.3937 1.3911 2.3034 1.4177 4.9795 4.6724 5.1584 4.6243 3.2174 1.3867 4.3962 2.7278 3.6111 2.5263 2.0190 2.3983 2.1531 2.3015 1.7489 1.2709 1.5253 1.5885 2.2199 3.0191 1.3578 2.4951 1.6010 1.7072 1.2880 2.1666 2.0525 5.4860 3.0065 2.3030 2.5175 1.3668 1.0922 1.0935 8.6972 7.3560 1.0657 1.0607 1.0604 1.1034 1.1050 1.1034 1.0885 1.0941 1.0961 1.0969 1.1022
irintensity: 1.4290 1.7069 4.4526 1.5318 1.4312 3.9184 0.4143 0.5515 0.0463 0.9105 0.8942 1.4460 5.6868 1.8250 1.3950 0.8181 4.9809 2.9066 9.7236 37.2680 6.3696 4.6508 9.3928 5.1041 11.0853 13.1444 27.7036 10.1362 6.1738 13.0116 57.3458 25.5257 30.6084 25.1136 22.5252 0.2694 18.3381 26.8996 20.8706 22.7988 67.4854 14.5635 0.6174 92.3655 23.0990 24.3695 43.1752 13.4656 22.6664 20.3918 53.1076 15.7109 0.0714 19.3862 24.9107 23.3301 30.9647 10.8938 0.6359 11.5574 5.0144 0.8947 8.3639 9.6666 9.5943 21.2813 42.3726 73.4063 16.5582 6.0387 3.9416 31.1325 81.8646 45.7345 46.6064 6.8755 18.1717 23.5357 2.4864 0.8248 1.7347 1.7746 1.6520 2.0544
temp: 298.150 k
press: 1.00000 atm
elementType: 17 17 8 8 7 7 7 6 6 6 6 6 6 6 6 6 6 6 6 1 1 1 1 1 1 1 1 1 1 1
symmnumber: 1
zpe: 567018.2 jmol-1
zpe.correction: 0.215966 hartree
zpe.thermalcorrener: 0.232814 hartree
zpe.thermalcorrenthalpy: 0.233758 hartree
zpe.thermalcorrgfe: 0.168668 hartree
zpe.sumelectzpe: -1697.268123 hartree
zpe.sumelectthermal: -1697.251274 hartree
zpe.sumelectthermalent: -1697.250330 hartree
zpe.sumelectthermalfe: -1697.315421 hartree
dipole: -2.0380 -1.9856 1.9948
dipole: 3.4749
quadrupole: -145.5195 -118.2414 -121.0765
quadrupole: -4.6844 4.5540 -6.1937
quadrupole: -17.2403 10.0377 7.2026 -4.6844 4.5540 -6.1937
hfenergy: -1697.4840883 hartree
pointgroup: C01 [X(C12H11Cl2N3O2)]
dipole: 0.8297608 -0.1233028 -1.0795117 debye
polarizability: 240.2612883|-9.7978699|151.0511261|11.3008842|16.0332757|113.5248988 unknown
InChI: InChI=1S/C12H11Cl2N3O2/c13-9-1-2-10(11(14)5-9)12(18-3-4-19-12)6-17-8-15-7-16-17/h1-2,5,7-8H,3-4,6H2
charge 0 multiplicity 1
30 atoms
Cl 1.215296 2.424259 1.263637
Cl 5.845011 -0.46331 0.51278
O  -0.712245 1.200764 -0.880189
O  -0.688313 -1.150986 -1.125797
N  -2.494047 -0.113372 0.962902
N  -3.273148 -1.27515 1.090681
N  -4.597966 0.567967 0.583347
C  -0.287287 -0.052505 -0.224837
C  -1.044142 -0.176046 1.124965
C  1.236204 -0.112361 -0.028389
C  -0.918802 0.876459 -2.313975
C  -1.457525 -0.56181 -2.251323
C  1.990449 0.903632 0.609743
C  1.945983 -1.255082 -0.479973
C  3.387363 0.81494 0.775756
C  3.341659 -1.381397 -0.32516
C  -3.30411 0.964459 0.663452
C  4.043693 -0.335723 0.301883
C  -4.526318 -0.798507 0.850267
H  -0.708053 0.625102 1.803398
H  -0.805865 -1.154126 1.570408
H  0.041481 0.937898 -2.859904
H  -1.635249 1.614111 -2.705244
H  -2.537181 -0.59289 -2.019061
H  -1.236744 -1.165394 -3.145495
H  1.371363 -2.045492 -0.969418
H  3.94121 1.621234 1.262146
H  3.866604 -2.271093 -0.682636
H  -2.927329 1.970687 0.510032
H  -5.396492 -1.448767 0.877904
