program: Gaussian 09
title: 000005248
version: EM64L-G09RevD.01
frameworkgroup: C1[X(C14H30O4S)]
method: RPBEPBE
basis: SDD
operation: Freq
keyword: #p
keyword: freq=noraman
keyword: PBEPBE/SDD
title: #p freq=noraman PBEPBE/SDD
converged: YES YES NO NO
title: Mulliken charges:
elementType: S O O O O C C C C C C C C C C C C C C H H H H H H H H H H H H H H H H H H H H H H H H H H H H H H
charge: 1.198835 -0.387529 -0.543380 -0.476005 -0.484111 -0.385622 -0.386353 -0.386106 -0.384469 -0.384038 -0.382299 -0.378177 -0.372600 -0.380967 -0.353483 -0.382082 -0.356560 -0.299477 -0.696554 0.194154 0.194646 0.194388 0.193725 0.195842 0.194711 0.193084 0.193361 0.195337 0.196256 0.192310 0.191878 0.200072 0.197626 0.189447 0.189363 0.199457 0.200911 0.187533 0.187833 0.226284 0.222617 0.194776 0.194717 0.245533 0.235142 0.209661 0.209684 0.215185 0.385439
chargesum: 0.00000
title: Mulliken charges with hydrogens summed into heavy atoms:
elementType: S O O O O C C C C C C C C C C C C C C
charge: 1.198835 -0.387529 -0.157941 -0.476005 -0.484111 0.003179 0.001760 0.004447 0.001976 0.007555 0.001889 0.019521 0.006211 0.019402 0.021883 0.066819 0.032933 0.181199 -0.062023
polarizability: 3.00067345e+02 2.21041696e+00 1.66437830e+02 1.80902521e+00 1.58970196e+00 1.58881271e+02
1716.lowfreq: -3.1971 -0.0014 0.0011 0.0019 4.9127 11.8862 13.8081 15.4661 27.9658
frequency: 13.1454 15.2125 27.9307 42.8318 43.5142 48.2881 60.9312 72.3242 81.7588 82.4834 100.0555 106.5540 110.1254 124.8429 133.7280 138.5032 145.8134 160.0283 161.4152 175.9188 183.6742 221.0599 224.1931 230.9658 259.8302 284.7345 313.9241 322.1288 329.9831 381.4486 395.0864 444.1267 448.5631 496.7398 498.3282 539.4877 592.1402 722.7698 724.0766 727.5372 735.1731 749.3984 770.8586 799.9094 835.5471 862.8154 878.1345 886.9187 888.0330 923.1128 966.6417 967.7558 976.0128 984.1607 1002.9796 1006.8492 1020.7183 1035.7309 1036.8469 1054.2079 1062.2637 1075.2440 1079.2680 1081.5838 1082.1894 1088.6665 1102.9548 1123.6381 1151.1003 1181.3500 1197.0307 1201.5106 1218.2375 1227.4006 1240.4398 1251.1418 1260.6516 1273.4933 1274.3212 1279.4473 1283.9051 1287.1338 1294.5513 1295.3538 1295.7526 1301.6148 1301.9810 1316.3339 1334.3851 1347.3605 1352.0719 1354.4329 1356.4220 1357.7675 1359.2586 1387.9238 1460.9097 1460.9773 1463.3783 1463.8017 1465.6897 1467.5103 1468.9981 1472.5181 1475.8313 1476.5956 1480.6340 1484.4636 1487.8188 1490.2627 1491.7709 2949.3381 2949.5180 2951.0576 2951.5713 2953.0405 2955.4086 2958.4293 2961.3397 2964.7616 2968.6063 2970.1094 2971.5543 2982.2859 2984.9114 2988.6027 2993.5110 2994.1193 2999.5682 3004.7207 3006.3668 3014.5659 3023.4854 3032.0621 3039.4717 3044.6987 3056.4160 3067.9036 3070.3688 3082.8016 3473.2844
redmass: 5.1097 5.0244 4.7514 4.7498 2.4351 3.6501 1.6014 3.6601 1.8256 3.6173 2.5158 3.6821 2.3392 2.0339 4.4097 2.2109 1.9670 2.0834 2.0086 2.2559 2.7338 4.7733 1.1378 5.6273 3.5713 2.6188 5.4183 4.2426 8.6512 3.9114 5.2864 3.2985 4.5468 3.0764 3.2857 10.9832 12.5357 1.0585 1.0648 1.0746 1.0913 1.1127 1.1367 1.1698 1.2061 14.5362 1.2333 2.3663 4.7369 1.2193 1.8076 1.7425 5.1504 4.9037 4.2839 1.1370 3.8878 3.5018 1.0632 3.1717 2.9015 2.4938 2.2906 2.2189 2.2070 2.4279 1.8596 3.0367 1.3539 1.8988 1.6159 1.2588 1.4618 1.2973 1.3589 1.2935 1.2738 1.2572 1.1696 1.0386 1.1090 1.0652 1.1136 1.1184 1.2726 1.1051 1.1150 1.3335 1.3841 1.4638 1.5319 1.6682 1.5058 1.6419 1.4749 1.2174 1.0729 1.0731 1.0707 1.0688 1.0694 1.0691 1.0768 1.0821 1.0428 1.0830 1.0867 1.0906 1.0936 1.0960 1.0972 1.0585 1.0585 1.0589 1.0590 1.0592 1.0593 1.0592 1.0591 1.0587 1.0587 1.0585 1.0365 1.0960 1.0968 1.0980 1.0995 1.0560 1.1010 1.0588 1.1014 1.1040 1.1048 1.1050 1.1048 1.1045 1.1060 1.1007 1.0992 1.1087 1.0662
irintensity: 0.4023 0.3864 0.5608 0.3441 0.6913 0.5646 0.4871 0.4816 0.3457 0.8864 0.6267 0.2461 0.3622 0.4788 2.0645 0.6741 0.2241 0.2153 0.2336 37.7186 7.2551 12.6826 0.0071 5.4482 13.7206 56.1798 5.6425 6.9775 10.0826 15.2867 19.7557 1.4427 18.3367 0.4227 6.0999 78.3936 169.9885 17.6337 0.9386 9.5325 0.5117 4.2265 0.1706 1.7070 0.2413 137.9452 0.7774 1.6574 22.6477 0.6020 32.3930 26.5549 4.0584 0.8487 1.6229 0.4784 4.7444 7.1782 0.1188 3.1742 0.2516 0.1184 1.3770 1.1048 0.0206 18.0536 55.1035 30.2925 1.3867 0.0156 0.9697 43.4001 0.0159 3.0399 0.0075 2.7359 0.0210 0.8047 0.3827 0.1932 0.0321 0.0421 0.0428 0.3292 0.5593 0.0012 0.0142 0.6304 0.1386 1.2107 2.7171 0.4339 1.7398 0.6510 1.0665 11.1872 0.0186 0.0031 0.0116 0.0511 0.0074 1.8750 5.8647 0.3827 12.2849 4.9980 0.6685 5.1617 0.8338 15.6164 45.7914 0.0162 0.0608 0.0223 0.2439 0.1923 1.5273 0.6411 3.5412 51.9981 113.9032 218.3755 38.8418 0.0262 0.0257 0.0167 0.0524 15.2317 0.1643 40.4362 1.0726 0.8357 0.1959 8.3951 12.2995 312.7735 18.7780 100.1628 55.5393 61.9082 64.6216
temp: 298.150 k
press: 1.00000 atm
elementType: 16 8 8 8 8 6 6 6 6 6 6 6 6 6 6 6 6 6 6 1 1 1 1 1 1 1 1 1 1 1 1 1 1 1 1 1 1 1 1 1 1 1 1 1 1 1 1 1 1
symmnumber: 1
zpe: 1110859.6 jmol-1
zpe.correction: 0.423104 hartree
zpe.thermalcorrener: 0.449269 hartree
zpe.thermalcorrenthalpy: 0.450214 hartree
zpe.thermalcorrgfe: 0.361854 hartree
zpe.sumelectzpe: -1248.651701 hartree
zpe.sumelectthermal: -1248.625536 hartree
zpe.sumelectthermalent: -1248.624592 hartree
zpe.sumelectthermalfe: -1248.712951 hartree
dipole: -4.1997 0.2008 2.0938
dipole: 4.6970
quadrupole: -176.2490 -135.7841 -123.0284
quadrupole: 2.7557 19.0864 0.7346
quadrupole: -31.2285 9.2364 21.9921 2.7557 19.0864 0.7346
hfenergy: -1249.0748051 hartree
pointgroup: C01 [X(C14H30O4S1)]
dipole: -1.6477085 -0.3484256 -0.7606391 debye
polarizability: 300.0933758|-2.1085236|166.5994527|-0.4061981|-1.0711359|158.6936181 unknown
InChI: InChI=1S/C14H30O4S/c1-2-3-4-5-6-7-8-9-10-11-12-13-14-18-19(15,16)17/h15H,2-14H2,1H3
charge 0 multiplicity 1
49 atoms
S  8.282457 0.104721 0.18275
O  6.613359 -0.658795 0.244364
O  8.47607 0.343354 -1.635125
O  8.247769 1.593767 0.769031
O  9.295156 -1.03202 0.681164
C  -2.201499 0.373099 -0.081366
C  -3.50639 -0.418398 0.160149
C  -0.924174 -0.451795 0.1938
C  -4.782803 0.405776 -0.121451
C  0.378653 0.344249 -0.044498
C  -6.088984 -0.383605 0.120118
C  1.655814 -0.485311 0.217675
C  -7.364667 0.441139 -0.163895
C  2.95452 0.320689 -0.010659
C  -8.671861 -0.347478 0.07512
C  4.22534 -0.533022 0.22864
C  -9.946895 0.479854 -0.206528
C  5.49524 0.304373 0.023694
C  -11.248452 -0.316435 0.029811
H  -2.18342 0.737366 -1.130053
H  -2.198669 1.278465 0.561368
H  -3.527351 -0.779136 1.209978
H  -3.508278 -1.325951 -0.479578
H  -0.94339 -0.818967 1.241297
H  -0.92573 -1.354969 -0.451941
H  -4.761898 0.765914 -1.171572
H  -4.780683 1.313912 0.517485
H  0.392512 0.719038 -1.08936
H  0.383049 1.242301 0.608127
H  -6.111299 -0.74262 1.170555
H  -6.091117 -1.29239 -0.517909
H  1.638799 -0.867324 1.25932
H  1.655271 -1.377364 -0.442622
H  -7.36321 1.349275 0.475147
H  -7.34161 0.801424 -1.213967
H  2.962193 0.717527 -1.046608
H  2.962704 1.200701 0.664899
H  -8.676411 -1.254391 -0.565632
H  -8.696143 -0.709672 1.124484
H  4.220667 -0.941074 1.256438
H  4.237677 -1.39206 -0.468132
H  -9.943327 1.383807 0.436636
H  -9.920049 0.844677 -1.253833
H  5.563295 1.128998 0.756963
H  5.555206 0.708177 -1.004627
H  -11.294431 -1.205279 -0.6277
H  -11.311178 -0.671214 1.076054
H  -12.144043 0.299707 -0.172225
H  8.782112 -0.532341 -2.014587
