program: Gaussian 09
title: 000043186
version: EM64L-G09RevD.01
frameworkgroup: C1[X(C7H9NO2)]
method: RPBEPBE
basis: SDD
operation: Freq
keyword: #pfreq=noraman
keyword: PBEPBE/SDD
title: #p freq=noraman PBEPBE/SDD
converged: YES YES NO NO
title: Mulliken charges:
elementType: O O N C C C C C C C H H H H H H H H H
charge: -0.429040 -0.228928 -0.625794 -0.268682 -0.176625 0.479575 -0.143012 -0.384261 -0.182956 -0.238126 0.233946 0.198300 0.233081 0.231756 0.227994 0.264785 0.298755 0.335691 0.173540
chargesum: 0.00000
title: Mulliken charges with hydrogens summed into heavy atoms:
elementType: O O N C C C C C C C
charge: -0.093350 -0.228928 -0.062253 -0.034736 0.021675 0.479575 0.090069 -0.152505 0.045038 -0.064586
polarizability: 1.20485776e+02 5.60986356e+00 9.26546867e+01 8.23485872e+00 1.79623379e+00 5.79274794e+01
1716.lowfreq: -13.7925 -6.4446 -0.0009 -0.0007 -0.0007 10.8742 48.7455 92.4728 166.4913
frequency: 48.7092 92.4480 166.4900 172.4977 213.7964 236.9113 247.8410 302.3208 345.8215 423.1964 450.9086 501.8068 585.0128 607.4598 628.8567 673.9208 749.0398 787.7195 875.8523 901.9068 926.9681 965.1672 978.0051 990.5099 1015.9886 1069.4254 1085.5705 1159.4217 1171.6650 1186.1300 1208.6284 1276.0237 1303.1749 1318.2107 1350.9768 1366.8964 1409.0025 1420.5811 1570.1950 1594.6206 1646.7306 1652.6993 2869.2328 2875.3169 2936.1633 3107.9917 3137.0149 3164.5968 3430.2493 3529.2880 3560.2274
redmass: 4.8236 4.2124 4.3082 4.1344 1.1978 2.0536 1.3327 3.2232 2.9896 6.0762 4.1925 3.3105 3.5664 3.2712 5.1542 1.8270 1.4376 3.5617 2.8510 1.5289 3.8673 3.8948 1.5965 1.4960 2.4380 1.8066 2.9791 1.1129 1.0613 1.1503 2.4784 1.1854 1.5050 1.2829 1.7070 1.3404 1.9168 2.1213 6.1708 8.2272 1.5177 2.3964 1.0806 1.0855 1.0836 1.0893 1.0872 1.1004 1.0458 1.0660 1.0962
irintensity: 4.8285 4.5991 6.0860 2.9194 15.0352 39.8757 155.6900 5.2470 25.2325 1.3328 4.9073 2.3759 40.1740 8.1719 30.1303 107.3583 49.1135 36.1648 7.7213 10.3979 21.3977 78.8436 4.8285 4.9495 10.5163 9.1844 2.3879 43.6527 7.4000 15.3965 86.5330 4.7631 1.9542 2.8718 6.7861 9.6759 27.9621 7.4357 302.5699 22.6520 49.8536 11.2387 63.6305 126.2516 56.3717 13.9840 8.6799 26.7927 2.5039 4.7786 2.7376
temp: 298.150 k
press: 1.00000 atm
elementType: 8 8 7 6 6 6 6 6 6 6 1 1 1 1 1 1 1 1 1
symmnumber: 1
zpe: 390516.1 jmol-1
zpe.correction: 0.148740 hartree
zpe.thermalcorrener: 0.158760 hartree
zpe.thermalcorrenthalpy: 0.159704 hartree
zpe.thermalcorrgfe: 0.113372 hartree
zpe.sumelectzpe: -476.530546 hartree
zpe.sumelectthermal: -476.520525 hartree
zpe.sumelectthermalent: -476.519581 hartree
zpe.sumelectthermalfe: -476.565913 hartree
dipole: 2.1173 0.1316 1.0778
dipole: 2.3795
quadrupole: -67.7084 -44.9351 -63.3325
quadrupole: -4.8784 1.0209 -0.9692
quadrupole: -9.0497 13.7235 -4.6738 -4.8784 1.0209 -0.9692
hfenergy: -476.6792854 hartree
pointgroup: C01 [X(C7H9N1O2)]
dipole: 0.8315813 0.0421323 0.4278986 debye
dipolederiv: -0.5238553 0.2118667 0.1202621 0.2847851 -0.2618918 -0.1084763 0.2000428 -0.1534995 -0.7028239 -1.014285 -0.1761566 -0.1228672 -0.5435833 -0.6417505 -0.0672198 -0.1078661 0.0045778 -0.3640975 -0.2510035 -0.0799614 0.0168991 -0.1296055 -0.3801378 -0.0534472 0.027505 -0.0397518 -0.7219683 -0.004957 0.0802482 -0.0775411 0.1056832 0.2604737 -0.0422288 -0.0461528 0.005177 0.505801 0.1703701 -0.0619844 -0.0992688 -0.2994074 0.3572556 0.0351986 -0.2013252 0.1724186 0.6570497 -0.9802775 -0.1507657 -0.1415356 -0.2443098 -0.042805 -0.0511915 -0.2337052 -0.0624827 -0.0917796 0.1381774 -0.0598002 0.0439682 -0.1728483 0.0334401 -0.0211251 -0.0397006 0.0280714 -0.1842651 0.5804541 -0.0689394 0.1168771 0.0968793 0.1035829 0.0224196 0.1366523 -0.0413728 -0.0898849 -0.2820331 0.141511 -0.0086911 0.4503505 0.050801 0.0927618 0.066393 0.0606112 -0.1339981 1.5763761 0.2418122 0.2726642 0.2054704 0.7294404 -0.0283773 0.3171077 0.0051606 0.1480297 0.0354361 -0.0445395 -0.0178227 -0.0050872 -0.0574885 -0.1197007 0.0093415 -0.0678651 -0.2009792 0.0297501 0.0545049 -0.0202182 0.1004007 -0.1179951 0.1137547 -0.0081247 0.068072 -0.1090064 -0.081704 -0.031077 -0.0454636 -0.0020688 0.0647485 -0.0044089 -0.0517529 -0.0055629 0.1451365 0.0363111 0.1039819 -0.0322097 0.0778866 -0.0591462 0.0246216 -0.0355711 0.0238275 0.1519487 0.0273699 -0.0736829 -0.0393936 -0.0928036 -0.0711721 -0.0423213 -0.0555032 -0.0337917 0.151109 0.1836304 0.0869436 0.0493838 0.0736803 -0.0066038 0.0967749 0.0660195 0.0206823 0.2214967 0.0331983 -0.009551 0.0610624 0.0021886 0.2451508 0.1009157 -0.0526176 0.0108116 0.2506872 0.3303982 -0.211333 -0.0472551 -0.0937963 0.0413536 -0.0175156 0.0376764 -0.0246658 0.2714463 -0.0033563 0.0469226 -0.0288503 0.1861855 -0.2472556 0.0695654 -0.0284188 0.0295822 0.0960982 unknown
polarizability: 120.4863124|5.3395074|92.5452438|8.5585796|2.1226151|58.0363863 unknown
InChI: InChI=1S/C7H9NO2/c8-7-5(4-9)2-1-3-6(7)10/h1-4,6-7,10H,8H2
charge 0 multiplicity 1
19 atoms
O  1.857603 -1.133418 -1.406647
O  -2.972999 -0.511347 -0.520378
N  -0.488168 -1.327522 1.499845
C  -0.142077 -0.906654 0.117797
C  1.409206 -0.882562 -0.015497
C  -0.787134 0.448786 -0.135448
C  2.054231 0.433716 0.356321
C  -0.070036 1.615755 0.009447
C  1.348394 1.605769 0.346864
C  -2.219069 0.506643 -0.452516
H  -0.535886 -1.610626 -0.657135
H  1.806535 -1.681792 0.650334
H  3.131311 0.42331 0.556293
H  -0.574012 2.582086 -0.1329
H  1.848788 2.556293 0.562752
H  -0.115646 -2.253733 1.743672
H  -1.496541 -1.274983 1.683134
H  1.56646 -2.044989 -1.671572
H  -2.62986 1.534367 -0.622667
