program: Gaussian 09
title: 000043199
version: EM64L-G09RevD.01
frameworkgroup: C1[X(C14H19IO3)]
method: RPBEPBE
basis: SDD
operation: Freq
keyword: #p
keyword: freq=noraman
keyword: PBEPBE/SDD
title: #p freq=noraman PBEPBE/SDD
converged: YES YES NO NO
title: Mulliken charges:
elementType: I O O O C C C C C C C C C C C C C C H H H H H H H H H H H H H H H H H H H
charge: 0.106590 -0.258198 -0.243869 -0.286883 -0.019131 -0.424448 0.003408 -0.727169 -0.692327 -0.710076 0.327819 -0.453314 0.486897 -0.371090 -0.365867 -0.161188 -0.161132 -0.339581 0.191138 0.217149 0.193539 0.248973 0.217299 0.211489 0.216337 0.210250 0.199401 0.236918 0.225209 0.246028 0.214688 0.234740 0.238300 0.241662 0.242139 0.252256 0.252042
chargesum: 0.00000
title: Mulliken charges with hydrogens summed into heavy atoms:
elementType: I O O O C C C C C C C C C C C C C C
charge: 0.106590 -0.258198 -0.243869 -0.286883 0.172007 -0.013760 0.252381 -0.082043 -0.045758 -0.024150 0.327819 0.019726 0.486897 -0.129428 -0.123728 0.091068 0.090910 -0.339581
polarizability: 2.74419066e+02 2.60863457e+01 1.55335940e+02 -1.56390374e+01 1.23531624e+01 1.34273085e+02
1716.lowfreq: -10.7840 -6.9547 -4.5235 -0.0008 -0.0007 -0.0006 1.0878 6.8227 12.5864
frequency: -10.2282 5.9682 11.3082 24.8463 40.4638 59.4155 89.6184 112.8942 131.1857 134.2359 177.0469 188.1878 203.6220 214.9323 216.8280 239.7434 259.8045 275.4926 321.7376 340.6551 346.0075 369.5822 378.9262 402.7712 420.0390 466.9881 530.2063 563.0898 591.4111 624.8343 675.9716 695.8429 719.2480 756.5634 780.6471 814.2911 827.4825 835.3481 868.1036 889.3612 895.7037 915.7343 953.6609 955.9906 959.4120 967.4817 971.2220 992.4565 999.4671 1014.3178 1049.7385 1054.3904 1115.1457 1119.4389 1124.9569 1157.3894 1179.4057 1192.3415 1195.7487 1198.4690 1228.8175 1250.8766 1288.8135 1298.0562 1319.7079 1333.2849 1338.0331 1360.7924 1372.2198 1372.5634 1379.4104 1386.2726 1388.4250 1397.7938 1440.3121 1463.5084 1465.0104 1470.6225 1471.9212 1473.4318 1478.8138 1483.7803 1489.2076 1579.2614 1600.3151 1608.7756 2953.3225 2967.3731 2975.2476 2981.2147 2990.2185 3016.7894 3024.6583 3042.7103 3060.4398 3065.0486 3069.2873 3081.4619 3088.0911 3094.1577 3099.8418 3134.6557 3136.7959 3169.1898 3172.6658
redmass: 3.8820 3.4697 3.4170 5.8911 4.7029 7.1925 5.4767 2.9187 6.7072 3.8452 3.7889 3.3784 4.4556 1.1373 1.2794 1.0468 3.7742 5.4736 4.6546 2.4162 2.0927 2.3382 3.0099 2.8266 3.4107 3.0685 3.2541 2.8250 5.2148 6.8659 6.3371 11.9444 4.0345 3.3883 3.2166 2.0542 3.8463 1.2474 1.7138 3.4743 1.9520 1.2095 1.5813 1.4032 1.4257 2.2525 1.3856 5.1828 3.8349 1.9901 1.6288 2.4955 1.3630 2.0186 2.1189 2.7921 2.6190 1.1561 1.0919 1.9588 2.3863 1.2425 1.3697 1.2641 1.4851 1.3346 1.3599 1.4794 1.7706 4.2237 1.2144 1.2221 2.5965 1.2240 1.0865 1.0469 1.0535 1.0568 1.1700 2.1955 1.0473 1.0485 1.0547 7.2223 6.2029 10.4939 1.0786 1.0363 1.0545 1.0466 1.0365 1.0578 1.0941 1.0917 1.0998 1.0993 1.0988 1.1081 1.0984 1.0984 1.1010 1.0900 1.0900 1.0952 1.0964
irintensity: 0.0070 0.0261 0.0353 0.0712 0.3960 1.4307 2.0105 1.2159 0.4859 0.5173 0.3739 0.9059 3.9141 0.7498 0.5701 0.0499 2.5680 14.0725 9.0718 0.1713 1.2835 3.3132 5.8435 0.0576 10.0271 4.8368 24.1151 4.8006 2.2513 0.2266 2.4919 17.5626 0.5439 20.8559 25.1443 49.3703 200.3270 0.0386 2.6868 0.7688 30.5961 5.5580 1.4647 0.3823 0.1345 50.6171 0.0281 119.5383 33.1330 4.5298 21.4655 26.7965 5.8831 275.1212 1.1248 390.6723 546.2348 37.0062 4.4718 54.9213 0.6007 10.4055 5.0045 0.1557 10.6159 2.8532 14.7607 15.4031 8.1525 0.6045 20.6819 18.3065 11.2050 16.3357 4.6767 2.1938 7.4134 7.0650 18.0100 40.5686 14.3000 24.2968 10.8358 0.1387 36.3766 257.3290 20.4560 34.1505 51.8951 21.4023 26.1047 20.4065 5.0857 22.7177 48.4973 14.9914 72.4393 11.7905 36.8769 44.6528 23.1136 6.9137 9.0101 10.6884 0.1346
temp: 298.150 k
press: 1.00000 atm
elementType: 53 8 8 8 6 6 6 6 6 6 6 6 6 6 6 6 6 6 1 1 1 1 1 1 1 1 1 1 1 1 1 1 1 1 1 1 1
symmnumber: 1
zpe: 786427.2 jmol-1
zpe.correction: 0.299534 hartree
zpe.thermalcorrener: 0.318857 hartree
zpe.thermalcorrenthalpy: 0.319802 hartree
zpe.thermalcorrgfe: 0.246008 hartree
zpe.sumelectzpe: -780.690794 hartree
zpe.sumelectthermal: -780.671471 hartree
zpe.sumelectthermalent: -780.670526 hartree
zpe.sumelectthermalfe: -780.744320 hartree
dipole: -1.7560 -0.1955 -0.0352
dipole: 1.7672
quadrupole: -112.5349 -120.0968 -122.3220
quadrupole: -4.3244 4.8225 7.3587
quadrupole: 5.7830 -1.7789 -4.0041 -4.3244 4.8225 7.3587
hfenergy: -780.9903279 hartree
pointgroup: C01 [X(C14H19I1O3)]
dipole: -0.6690093 0.188631 0.0148615 debye
polarizability: 262.4713819|-44.6710312|166.2354755|16.9551954|10.4028657|135.3212334 unknown
InChI: InChI=1S/C14H19IO3/c1-10(2)8-11(3)18-14(16)17-9-12-4-6-13(15)7-5-12/h4-7,10-11H,8-9H2,1-3H3
charge 0 multiplicity 1
37 atoms
I  6.637097 -1.866295 0.405615
O  -2.126068 0.479562 0.704348
O  0.005639 0.615682 0.064097
O  -1.560511 2.021514 -0.9839
C  -4.458341 -1.562418 0.257425
C  -4.409155 -0.280295 1.141399
C  -3.578432 0.908376 0.635373
C  -4.823731 -1.251332 -1.214906
C  -3.170738 -2.418533 0.343408
C  -3.744499 2.173181 1.488894
C  -1.266942 1.13157 -0.148824
C  1.065716 1.232017 -0.812249
C  2.357231 0.510348 -0.526428
C  3.254419 0.997606 0.455119
C  2.69627 -0.668971 -1.234219
C  4.467704 0.328086 0.730493
C  3.903925 -1.353647 -0.973255
C  4.781768 -0.844354 0.008974
H  -5.283993 -2.17639 0.677609
H  -4.055183 -0.546105 2.157188
H  -5.444399 0.102644 1.256626
H  -3.795024 1.138566 -0.423659
H  -4.000899 -0.725149 -1.734579
H  -5.731677 -0.622273 -1.287816
H  -5.016036 -2.187151 -1.771377
H  -2.932733 -2.675209 1.392243
H  -3.297737 -3.362832 -0.219386
H  -2.299242 -1.881617 -0.067524
H  -3.478928 1.971063 2.541654
H  -3.108186 2.989496 1.10704
H  -4.794749 2.51605 1.454513
H  1.121655 2.308136 -0.570942
H  0.742733 1.125437 -1.862707
H  3.007047 1.906027 1.016607
H  2.012641 -1.06398 -1.994603
H  5.151429 0.716712 1.490145
H  4.153328 -2.262524 -1.527698
