program: Gaussian 09
title: 000043154
version: EM64L-G09RevD.01
frameworkgroup: C1[X(C8H8O5)]
method: RPBEPBE
basis: SDD
operation: Freq
keyword: #p
keyword: freq=noraman
keyword: PBEPBE/SDD
title: #p freq=noraman PBEPBE/SDD
converged: YES YES NO NO
title: Mulliken charges:
elementType: O O O O O C C C C C C C C H H H H H H H H
charge: -0.232264 -0.413760 -0.415478 -0.228108 -0.229328 -0.242043 -0.239975 -0.161893 -0.227177 -0.225499 -0.208055 0.167066 0.169712 0.326303 0.314537 0.272120 0.293722 0.254395 0.257597 0.381733 0.386396
chargesum: 0.00000
title: Mulliken charges with hydrogens summed into heavy atoms:
elementType: O O O O O C C C C C C C C
charge: -0.232264 -0.032027 -0.029082 -0.228108 -0.229328 0.084260 0.074562 0.110227 0.066545 0.028897 0.049542 0.167066 0.169712
polarizability: 1.06582861e+02 -3.47603517e+00 8.87890835e+01 -5.44895189e+00 6.84047000e+00 7.93944010e+01
1716.lowfreq: -6.3267 0.0006 0.0007 0.0009 3.2219 15.1098 30.9133 42.3569 73.9999
frequency: 30.5354 42.2998 73.9512 136.9915 139.6358 187.7991 303.4603 341.7980 361.5967 424.6651 477.8525 517.2858 563.8685 582.3311 601.0970 626.5422 655.2299 665.7980 716.8814 732.2039 780.1210 800.3050 830.7194 864.5522 882.2502 913.7832 925.2440 952.0852 966.1391 972.7262 980.9173 1022.3992 1076.0358 1083.8416 1097.3640 1141.5928 1176.5605 1205.2048 1213.8557 1237.1137 1252.0141 1273.6213 1291.8032 1301.2960 1311.6795 1361.7539 1582.7948 1656.8779 1660.8317 3011.9211 3082.1283 3148.5777 3154.6740 3186.8523 3218.7179 3512.2333 3516.7839
redmass: 9.0050 9.8208 6.7269 5.5209 6.2309 5.6537 6.5385 5.9908 5.5785 4.7648 3.0730 3.2612 3.2341 2.7539 3.1272 1.8598 1.8984 2.1144 2.7053 3.7293 5.8971 5.4542 3.0070 3.6749 4.4513 2.3128 1.9305 3.5880 2.2896 3.0416 4.8891 2.5701 1.8216 1.8271 1.5248 1.1603 1.4307 1.2735 1.2748 1.3139 1.3718 1.5528 1.7307 1.8032 2.1804 2.0834 6.1792 9.4439 8.9523 1.0826 1.0843 1.0903 1.0950 1.0883 1.1113 1.0639 1.0641
irintensity: 1.9727 0.7639 0.5337 2.5738 2.2709 0.1196 4.0073 6.4144 6.7812 3.7631 3.6147 20.4677 42.9003 97.1989 48.6441 50.9195 55.6380 119.6607 31.2662 3.9421 13.0319 3.6674 99.7506 8.5120 26.9195 16.2213 9.6995 3.0782 2.1208 34.5362 44.1091 110.8919 139.7264 194.8872 42.1301 10.4975 27.8345 6.3510 2.0673 2.2044 2.3342 13.1431 11.9794 21.7990 37.7107 44.4042 2.3449 263.7807 192.9859 10.3661 1.8299 14.2579 1.6220 1.2614 4.7612 25.1775 30.1779
temp: 298.150 k
press: 1.00000 atm
elementType: 8 8 8 8 8 6 6 6 6 6 6 6 6 1 1 1 1 1 1 1 1
symmnumber: 1
zpe: 399727.4 jmol-1
zpe.correction: 0.152248 hartree
zpe.thermalcorrener: 0.163392 hartree
zpe.thermalcorrenthalpy: 0.164337 hartree
zpe.thermalcorrgfe: 0.113649 hartree
zpe.sumelectzpe: -684.768644 hartree
zpe.sumelectthermal: -684.757500 hartree
zpe.sumelectthermalent: -684.756556 hartree
zpe.sumelectthermalfe: -684.807244 hartree
dipole: 2.3416 -1.1643 -0.0798
dipole: 2.6163
quadrupole: -70.5388 -71.3258 -77.9833
quadrupole: 5.0737 -1.0039 7.9999
quadrupole: 2.7438 1.9568 -4.7006 5.0737 -1.0039 7.9999
hfenergy: -684.9208922 hartree
pointgroup: C01[X(C8H8O5)]
dipole: -0.9155476 0.4626416 -0.0852327 debye
dipolederiv: -0.5426678 0.0528444 0.022476 0.0380823 -0.6090078 -0.0280676 -0.0474387 -0.0323745 -0.4699053 -0.8439947 0.2156389 -0.4776607 0.1735635 -0.4678723 0.2313231 -0.4288952 0.2192422 -0.6424673 -0.3232722 -0.0445657 0.0009196 -0.0091441 -1.0680899 0.3164297 0.0010827 0.3478519 -0.5398963 -0.5798044 0.2441666 0.1000767 0.1347695 -0.4219867 -0.1826866 -0.1024994 -0.1627141 -0.8833969 -1.0031401 0.1817589 -0.1858237 -0.025687 -0.5805842 0.1202541 -0.0409149 0.1504254 -0.3925658 -0.1072176 0.1012736 0.0225802 0.1768855 -0.2888627 -0.0902724 0.1575641 -0.1337991 -0.1343128 -0.3060546 -0.116847 0.0134754 -0.0756703 -0.1507977 0.0031653 0.2033093 0.0959813 0.0278748 0.2770528 0.0075105 0.0138793 -0.1329276 0.6129735 0.0777665 0.0050625 0.0462909 0.3762788 0.2732614 0.0167614 0.0428457 0.0751497 0.4595316 0.0329927 0.040066 0.0078925 0.300268 -0.0362927 -0.0126101 -0.0302862 -0.0101256 -0.2326178 -0.0735669 -0.045221 -0.1550157 -0.1266948 -0.037122 0.0922505 0.0082253 0.0322177 -0.228607 -0.059707 -0.0042806 -0.0903515 -0.0136938 1.1807337 -0.7244524 0.2456338 -0.5091986 0.5392771 0.0589112 0.2789825 0.1641225 1.2613638 1.4062235 0.0327158 0.1369066 0.0759609 1.1944063 -0.48027 -0.0467832 -0.5705445 0.4630594 0.0952325 0.014755 0.0353482 0.0267248 0.0417988 0.0537746 0.0124512 0.0437182 0.0466325 0.1165417 -0.0419159 0.0256958 -0.0562971 0.0833786 -0.0323167 -0.0503089 -0.026368 0.0220855 0.0386289 -0.0074 -0.0505488 -0.0075936 0.0421246 0.0034624 -0.0787841 0.001921 -0.0461286 -0.0117361 0.0566629 -0.0398528 0.0406545 0.07189 0.0115584 -0.0113525 0.0018071 0.072265 -0.0435886 -0.043945 0.0325704 -0.0121741 0.1745085 0.0281478 0.032314 0.0666003 0.1043466 0.0944906 -0.0328589 0.0098716 -0.0089636 0.1592195 0.0674141 0.0205801 0.1056654 -0.0120935 0.2749179 0.0649548 0.0693406 0.0718242 0.3224896 -0.0740932 0.1177477 -0.108841 0.2165762 0.0778077 -0.0566982 0.0043271 0.0019487 0.3468279 0.0157805 -0.0126816 0.0284899 0.3704043 unknown
polarizability: 106.153785|-3.0812241|88.0713285|6.3985914|-7.4519643|80.5412325 unknown
InChI: InChI=1S/C8H8O5/c9-7(10)5-3-1-2-4(13-3)6(5)8(11)12/h1-6,9,11H
charge 0 multiplicity 1
21 atoms
O  0.480277 -1.649564 -1.063847
O  -2.542238 1.549577 -0.835027
O  1.906469 1.979284 -0.505639
O  -1.717932 1.531641 1.336016
O  3.171224 0.296766 0.466554
C  -0.451278 0.434463 -0.491353
C  0.713188 0.114785 0.495112
C  -0.872789 -1.03325 -0.96958
C  0.804548 -1.462658 0.389089
C  -1.482459 -1.765045 0.232058
C  -0.443106 -2.028798 1.070363
C  -1.58442 1.216417 0.133556
C  2.049682 0.755096 0.160213
H  -0.092055 0.984241 -1.374924
H  0.445593 0.435793 1.520607
H  -1.389539 -1.072981 -1.934637
H  1.786802 -1.887951 0.621963
H  -2.546721 -1.951006 0.383433
H  -0.464945 -2.47442 2.065913
H  -3.280746 2.061375 -0.405999
H  2.807645 2.373333 -0.662372
