program: Gaussian 09
title: 000043128
version: EM64L-G09RevD.01
frameworkgroup: C1[X(C14H18FNO)]
method: RPBEPBE
basis: SDD
operation: Freq
keyword: #p
keyword: freq=noraman
keyword: PBEPBE/SDD
title: #p freq=noraman PBEPBE/SDD
converged: YES YES NO NO
title: Mulliken charges:
elementType: F O N C C C C C C C C C C C C C C H H H H H H H H H H H H H H H H H H
charge: -0.196441 -0.218764 -0.084174 -0.364691 -0.353868 -0.438648 -0.449038 -0.371510 -0.403740 -0.533907 0.132179 0.295579 -0.310354 -0.321537 -0.386094 -0.369661 0.333734 0.170586 0.229171 0.215785 0.171629 0.204564 0.228001 0.225870 0.205494 0.154456 0.261432 0.234890 0.209229 0.226480 0.242335 0.254473 0.284630 0.259614 0.262296
chargesum: 0.00000
title: Mulliken charges with hydrogens summed into heavy atoms:
elementType: F O N C C C C C C C C C C C C C C
charge: -0.196441 -0.218764 -0.084174 0.035067 0.033545 -0.006084 -0.017674 0.044378 0.040379 -0.065092 0.132179 0.295579 -0.055882 -0.036907 -0.126480 -0.107365 0.333734
polarizability: 2.25509795e+02 -1.58101217e+00 1.49416754e+02 -1.42931414e+01 6.28263894e+00 1.02637894e+02
1716.lowfreq: -5.3784 -2.2692 -0.0004 0.0001 0.0008 4.6749 18.4261 24.8814 27.5476
frequency: 17.9098 24.7258 27.2468 39.8597 73.2711 86.5921 107.2180 128.6662 141.2683 208.1765 224.9040 279.5501 283.6126 331.2487 355.0817 370.6620 392.6413 411.2550 476.6329 476.9826 560.8336 572.7312 622.1144 624.7011 634.7837 694.7081 723.9580 751.4879 793.2137 815.4934 818.0494 839.6160 849.4171 858.4509 883.8790 898.7944 950.3605 958.8385 967.1273 969.9642 990.1673 1004.4250 1024.7921 1058.0229 1066.7867 1089.7954 1097.0069 1105.8364 1125.9494 1148.1703 1156.2196 1178.6077 1190.0631 1199.4294 1201.8820 1213.0663 1229.7016 1233.2233 1255.9883 1282.0048 1288.0357 1292.2881 1296.3799 1309.6150 1332.0965 1339.9148 1350.5463 1380.1181 1385.4631 1409.2214 1431.3853 1455.8991 1464.1977 1471.0423 1478.8291 1479.6578 1490.3024 1495.3748 1574.9463 1601.1223 1613.9173 2791.6600 2818.3408 2838.0027 2961.1039 2998.9022 3010.0146 3013.0576 3022.5484 3035.4984 3042.7689 3044.4096 3065.4431 3072.7089 3090.9794 3157.4852 3157.6454 3177.9272 3181.0825
redmass: 4.1382 3.2404 2.2397 2.8188 4.2577 3.3286 8.3523 4.0733 3.9661 2.0365 2.2220 6.3538 5.7225 2.2277 3.6833 5.0137 4.8498 2.9472 4.7429 3.1920 2.3240 5.8472 3.2653 6.4136 2.9397 2.5044 3.5220 1.4535 2.8047 2.1070 1.3493 1.4825 1.5068 2.5554 2.4246 2.5669 2.4531 1.5089 2.9631 1.5732 1.3502 2.6303 1.9383 2.2810 2.4470 1.7648 1.9459 1.3760 2.6173 2.0639 1.4275 1.2554 1.2790 1.3895 2.1053 1.8257 1.9675 1.5216 1.4395 1.1861 1.2802 1.2795 1.2250 1.2940 1.4766 1.7348 1.4605 5.0541 1.5184 4.0572 1.1056 1.0842 1.0821 1.0886 1.0780 1.0917 2.5669 1.1054 7.8744 7.0295 7.4332 1.0714 1.0714 1.0710 1.0602 1.0691 1.0596 1.0906 1.0655 1.0868 1.0857 1.0861 1.1047 1.1008 1.1053 1.0886 1.0887 1.0965 1.0975
irintensity: 0.0764 0.0777 0.0919 0.1893 1.8099 0.8450 2.2079 2.1284 1.0602 2.2763 2.1363 8.1244 0.9767 7.2759 2.8376 1.5773 9.5383 0.0213 5.3537 7.8923 9.2795 22.6717 4.9523 1.4200 0.3005 5.6287 0.0035 3.1216 6.6191 18.6064 27.2164 71.3646 3.6557 3.3445 4.3765 6.2279 26.9463 6.0867 25.5798 0.1993 0.8041 5.2478 11.1507 2.1356 6.7072 9.0366 10.0306 12.5854 38.3485 78.1441 68.3632 3.7914 8.8127 3.6234 5.9646 95.4056 107.3443 15.7589 8.2920 18.8116 4.4784 2.9677 14.6146 5.2741 0.9050 49.1238 15.7354 13.3598 5.9905 16.4450 28.4927 12.1537 3.7559 4.3608 0.5188 12.3779 26.8186 5.0517 110.8555 91.3277 41.5038 72.5848 74.8283 197.1250 42.8565 16.4969 24.4697 16.7741 72.7002 66.8022 24.7601 6.3243 0.8552 27.5608 77.4097 4.8383 1.7947 4.2921 4.1050
temp: 298.150 k
press: 1.00000 atm
elementType: 9 8 7 6 6 6 6 6 6 6 6 6 6 6 6 6 6 1 1 1 1 1 1 1 1 1 1 1 1 1 1 1 1 1 1
symmnumber: 1
zpe: 762721.6 jmol-1
zpe.correction: 0.290505 hartree
zpe.thermalcorrener: 0.307023 hartree
zpe.thermalcorrenthalpy: 0.307967 hartree
zpe.thermalcorrgfe: 0.242694 hartree
zpe.sumelectzpe: -772.809198 hartree
zpe.sumelectthermal: -772.792681 hartree
zpe.sumelectthermalent: -772.791737 hartree
zpe.sumelectthermalfe: -772.857010 hartree
dipole: -0.3294 -2.5133 -1.2197
dipole: 2.8130
quadrupole: -106.7235 -95.1535 -104.1992
quadrupole: 1.5484 4.6832 -1.6349
quadrupole: -4.6981 6.8719 -2.1738 1.5484 4.6832 -1.6349
hfenergy: -773.0997034 hartree
pointgroup: C01 [X(C14H18F1N1O1)]
dipole: -0.119184 -0.562702 -0.9454948 debye
polarizability: 226.1719341|4.4086948|129.4602457|-10.2647873|24.2520165|121.9322625 unknown
InChI: InChI=1S/C14H18FNO/c15-13-7-5-12(6-8-13)14(17)4-3-11-16-9-1-2-10-16/h5-8H,1-4,9-11H2
charge 0 multiplicity 1
35 atoms
F  6.399734 0.215781 -0.517091
O  0.331562 0.575789 1.51941
N  -3.713233 0.16605 0.003402
C  -4.379433 1.478801 -0.201008
C  -4.535985 -0.79942 -0.768791
C  -5.889625 1.150086 -0.081809
C  -5.995514 -0.36521 -0.469391
C  -2.270296 0.165971 -0.299787
C  -1.560136 -1.104281 0.21584
C  -0.066297 -1.152514 -0.162869
C  0.813416 -0.161835 0.610026
C  2.280977 -0.091141 0.280131
C  2.884364 -0.907869 -0.715052
C  3.089676 0.829882 1.002393
C  4.264471 -0.811961 -0.988474
C  4.468197 0.941519 0.744323
C  5.022997 0.113506 -0.249896
H  -4.15743 1.899003 -1.217261
H  -4.031141 2.209542 0.550421
H  -4.331764 -1.839273 -0.459158
H  -4.325272 -0.722874 -1.869188
H  -6.49632 1.796809 -0.739639
H  -6.236111 1.30435 0.954182
H  -6.405184 -0.948088 0.372969
H  -6.649742 -0.532161 -1.343095
H  -2.086722 0.269034 -1.405911
H  -1.816689 1.043593 0.193858
H  -1.673206 -1.140355 1.314057
H  -2.05481 -2.002588 -0.200653
H  0.05862 -0.968233 -1.250711
H  0.339486 -2.169845 0.017108
H  2.283623 -1.625038 -1.281919
H  2.607288 1.448356 1.765956
H  4.747766 -1.431197 -1.749336
H  5.104934 1.643712 1.289763
