program: Gaussian 09
title: 000043126
version: EM64L-G09RevD.01
frameworkgroup: C1[X(C17H24FNO)]
method: RPBEPBE
basis: SDD
operation: Freq
keyword: #p
keyword: freq=noraman
keyword: PBEPBE/SDD
title: #p freq=noraman PBEPBE/SDD
converged: NO YES NO NO
title: Mulliken charges:
elementType: F O N C C C C C C C C C C C C C C C C C H H H H H H H H H H H H H H H H H H H H H H H H
charge: -0.199964 -0.220924 -0.152604 0.078205 -0.465464 -0.440320 -0.414936 -0.396393 -0.381140 -0.346156 -0.658007 -0.482962 -0.494610 0.086442 0.306682 -0.322923 -0.330521 -0.404097 -0.370827 0.326085 0.164647 0.215685 0.218441 0.195073 0.196236 0.202800 0.191627 0.192020 0.200023 0.199483 0.191133 0.189645 0.244312 0.224947 0.194531 0.237878 0.220772 0.243124 0.232434 0.236236 0.295651 0.281498 0.256257 0.259982
chargesum: 0.00000
title: Mulliken charges with hydrogens summed into heavy atoms:
elementType: F O N C C C C C C C C C C C C C C C C C
charge: -0.199964 -0.220924 -0.152604 0.242852 -0.031338 -0.049012 -0.020509 -0.004350 0.009476 0.087801 -0.000652 -0.019065 -0.025940 0.086442 0.306682 -0.027272 -0.049022 -0.147840 -0.110845 0.326085
polarizability: 1.98475206e+02 2.15778959e+00 2.25763343e+02 1.90500646e+01 -6.64030331e+00 1.43728365e+02
1716.lowfreq: -5.1530 -0.0007 -0.0006 -0.0005 5.8244 8.3310 19.3979 29.3066 44.5109
frequency: 19.3041 28.6729 44.3839 54.3946 63.8731 99.2493 109.3114 121.8574 147.5995 182.2144 188.2800 219.0248 227.6844 274.6508 292.4512 315.7974 321.0158 353.3376 366.2945 372.6114 392.7229 415.7131 419.0562 432.5130 457.7611 467.7553 487.6395 493.1569 548.3433 581.0494 621.1617 628.3395 699.5174 742.7103 769.4552 787.4086 791.9014 801.4639 829.1055 830.8226 849.3775 854.5391 882.4799 892.4447 897.2423 925.9480 958.6894 978.1157 983.1415 990.1368 997.6293 1007.4438 1028.5029 1053.3165 1056.7096 1064.0184 1076.0792 1091.9616 1105.6437 1108.8585 1113.6912 1117.4599 1147.4302 1156.5364 1171.8480 1178.3610 1205.4982 1214.4135 1232.2846 1247.0431 1253.2039 1257.9970 1262.4805 1280.7327 1305.3239 1310.9685 1315.0199 1324.4290 1332.9961 1338.7769 1343.0763 1345.5054 1350.8150 1371.3535 1376.9014 1378.6103 1409.2752 1434.1537 1454.2818 1461.1975 1462.8996 1465.4442 1465.7653 1472.6815 1473.4227 1476.2232 1480.3173 1493.0305 1495.9672 1562.0408 1597.6864 1607.4505 2818.8177 2844.1977 2868.9796 2966.4710 2967.2219 2968.8439 2975.5012 2979.3075 2996.8403 3010.5767 3029.4384 3029.9729 3038.0211 3039.4812 3044.1446 3048.9548 3051.7991 3061.4095 3087.6796 3100.2544 3101.5547 3155.7708 3167.2545 3177.8885
redmass: 6.2660 5.1336 2.9751 4.2926 3.6123 7.4719 3.0203 3.9618 1.8243 3.4700 1.6659 3.9458 1.8547 3.8482 3.0821 2.3987 4.8477 2.5545 2.0562 6.1949 2.9351 2.9135 2.4256 2.8801 4.1043 2.5384 1.6621 3.2965 3.5316 2.6303 6.0216 5.1164 3.3784 2.6327 2.7726 1.4763 3.4940 3.1668 1.9935 1.3669 2.0020 1.6985 1.9601 2.1632 1.4798 2.1245 2.1598 1.8984 1.7543 1.5777 1.7267 2.4528 2.2459 1.3708 1.8365 1.8724 1.4501 2.4245 1.4365 1.3645 1.8650 2.3055 2.1632 1.5651 1.4225 1.5142 1.9089 2.0411 1.5799 1.3797 1.9310 1.3347 1.2525 1.2788 1.2856 1.2576 1.2826 1.5312 1.4525 1.4205 1.5043 1.4705 1.4033 1.4299 1.5457 3.4314 3.7225 1.1636 1.0880 1.1812 1.0883 1.0862 1.0765 1.0627 1.0820 1.0818 1.0937 1.0724 2.1519 8.5842 6.9940 6.5774 1.0804 1.0713 1.0577 1.0652 1.0607 1.0628 1.0614 1.0624 1.0611 1.0633 1.0975 1.0954 1.0996 1.0944 1.1008 1.0823 1.0941 1.0937 1.0981 1.0944 1.0983 1.0889 1.0940 1.0971
irintensity: 1.4157 0.1370 0.4069 0.5872 0.8082 3.3145 0.1871 0.8005 0.1916 1.9927 1.3148 5.3503 0.7221 0.6923 2.7055 3.4625 0.8571 0.5737 6.9757 3.9621 1.4047 0.0831 1.1564 0.5403 0.5802 0.9539 0.6644 19.0708 22.7019 6.7812 2.1220 6.1538 2.6693 8.8456 18.4001 0.4905 5.3685 33.2087 3.3551 2.1003 14.2852 65.2904 4.0065 4.9463 12.8070 0.3010 17.3075 13.2363 24.1314 6.3994 1.7559 2.5330 28.4935 1.7004 3.6102 3.9740 2.2070 4.5004 2.4253 1.7893 32.2795 0.2644 4.4802 58.3499 46.1543 10.1878 11.2027 13.9205 1.7501 0.2243 118.7789 17.4645 6.4010 12.8622 3.0672 0.1379 0.6238 62.0787 2.9462 3.8561 0.2789 7.0038 5.5524 11.9109 3.4223 9.5474 16.4502 7.9634 1.0265 19.0654 7.5400 3.6224 28.2411 7.1552 21.7700 1.2277 4.6966 24.9663 25.9954 135.7841 59.0371 70.3370 61.3437 93.8627 167.0034 36.1997 31.5153 41.2055 11.1073 45.5897 35.4133 21.5161 65.6074 68.2534 11.6465 2.6428 37.7057 82.4914 67.4800 48.6834 22.9749 25.1856 30.2045 0.2155 4.0392 6.5139
temp: 298.150 k
press: 1.00000 atm
elementType: 9 8 7 6 6 6 6 6 6 6 6 6 6 6 6 6 6 6 6 6 1 1 1 1 1 1 1 1 1 1 1 1 1 1 1 1 1 1 1 1 1 1 1 1
symmnumber: 1
zpe: 987378.9 jmol-1
zpe.correction: 0.376073 hartree
zpe.thermalcorrener: 0.395616 hartree
zpe.thermalcorrenthalpy: 0.396560 hartree
zpe.thermalcorrgfe: 0.326743 hartree
zpe.sumelectzpe: -890.478243 hartree
zpe.sumelectthermal: -890.458700 hartree
zpe.sumelectthermalent: -890.457756 hartree
zpe.sumelectthermalfe: -890.527573 hartree
dipole: -3.5067 -0.3450 -1.0394
dipole: 3.6737
quadrupole: -121.3304 -127.8313 -121.4238
quadrupole: 4.9345 -1.2098 6.0031
quadrupole: 2.1981 -4.3028 2.1047 4.9345 -1.2098 6.0031
hfenergy: -890.854316 hartree
pointgroup: C01 [X(C17H24F1N1O1)]
dipole: 1.3500484 0.074811 -0.5106697 debye
polarizability: 195.6412257|4.1556289|225.383731|-22.5756439|7.8592141|146.9419569 unknown
InChI: InChI=1S/C17H24FNO/c1-19(16-6-3-2-4-7-16)13-5-8-17(20)14-9-11-15(18)12-10-14/h9-12,16H,2-8,13H2,1H3
charge 0 multiplicity 1
44 atoms
F  -2.99979 -3.62691 -0.304647
O  -2.714534 2.582835 1.260468
N  1.653014 1.372476 -0.516931
C  2.588606 0.25103 -0.128115
C  2.178457 -0.47175 1.181225
C  2.681591 -0.792183 -1.276101
C  3.147999 -1.631508 1.51953
C  3.663124 -1.940805 -0.944324
C  3.261734 -2.652754 0.366225
C  1.150423 2.17594 0.636234
C  2.287136 2.2496 -1.5339
C  0.132826 3.272217 0.245837
C  -1.102309 2.744014 -0.53701
C  -2.070882 1.96328 0.358011
C  -2.282087 0.490369 0.156397
C  -1.376213 -0.313769 -0.589104
C  -3.422936 -0.113978 0.756754
C  -1.607939 -1.697839 -0.738736
C  -3.675515 -1.489516 0.604533
C  -2.757243 -2.249021 -0.146183
H  3.61682 0.672385 0.041023
H  1.148698 -0.868072 1.070397
H  2.171079 0.232747 2.032359
H  2.987786 -0.311906 -2.223439
H  1.666133 -1.206922 -1.440694
H  2.808201 -2.131833 2.446717
H  4.153874 -1.213604 1.733406
H  4.688974 -1.530256 -0.839394
H  3.692084 -2.660917 -1.78467
H  3.997621 -3.439492 0.621376
H  2.284035 -3.158088 0.224151
H  1.994326 2.66683 1.187307
H  0.655732 1.490386 1.344857
H  2.682364 1.64662 -2.36631
H  3.13127 2.850888 -1.111963
H  1.548055 2.948026 -1.960223
H  0.621492 4.064894 -0.350439
H  -0.222551 3.75588 1.175728
H  -1.67209 3.617587 -0.907785
H  -0.771962 2.154947 -1.407115
H  -0.462602 0.131406 -1.004502
H  -4.097825 0.52076 1.33981
H  -0.921138 -2.338975 -1.299196
H  -4.551436 -1.971716 1.047738
