program: Gaussian 09
title: 000042997
version: EM64L-G09RevD.01
frameworkgroup: C1[X(C10H10N2O2)]
method: RPBEPBE
basis: SDD
operation: Freq
keyword: #p
keyword: freq=noraman
keyword: PBEPBE/SDD
title: #p freq=noraman PBEPBE/SDD
converged: YES YES NO NO
title: Mulliken charges:
elementType: O O N N C C C C C C C C C C H H H H H H H H H H
charge: -0.241516 -0.255780 -0.447203 -0.669908 0.268181 0.263519 0.176466 0.084277 -0.367418 -0.343233 0.080119 -0.268842 -0.225918 -0.642924 0.200297 0.298469 0.263010 0.227799 0.233966 0.229833 0.216084 0.266801 0.314538 0.339381
chargesum: 0.00000
title: Mulliken charges with hydrogens summed into heavy atoms:
elementType: O O N N C C C C C C C C C C
charge: -0.241516 -0.255780 -0.148734 -0.015989 0.268181 0.263519 0.176466 0.084277 -0.167121 -0.080223 0.080119 -0.041044 0.008049 0.069794
polarizability: 2.07218129e+02 -1.58493672e+01 1.58411769e+02 -2.69254740e+00 -3.66569463e+00 5.75408910e+01
1716.lowfreq: -9.1726 -7.1911 -0.0005 -0.0003 0.0005 7.3681 59.9312 71.6751 86.2764
frequency: 59.9250 71.6229 86.2753 104.1864 145.4823 219.4638 268.6581 270.8296 295.5073 333.6861 354.9089 379.5904 419.4402 432.0672 438.9542 468.7891 519.7455 527.7458 540.8963 617.5496 623.1209 652.1423 668.3716 697.6419 733.0253 758.0169 843.4004 850.2020 887.5433 934.5387 974.4007 976.2603 1035.4272 1070.2969 1078.6352 1109.9724 1115.0949 1145.6467 1172.1919 1201.7912 1242.9292 1284.1480 1336.5904 1359.6611 1401.6935 1442.4956 1447.1662 1457.3891 1472.8239 1490.3169 1523.9643 1561.6445 1589.6088 1611.0533 1628.5535 1640.7694 2948.7392 3036.8038 3102.3148 3123.4209 3143.9414 3160.4421 3177.1855 3530.3410 3579.0633 3693.9445
redmass: 1.2739 2.1620 3.3110 6.0056 4.1730 4.3881 4.2488 4.5140 2.8470 2.2369 2.1032 4.4679 6.0127 1.7315 6.6946 2.1103 4.9382 1.1764 4.3153 6.1807 5.8839 6.8189 6.6742 7.7631 3.2840 1.4453 3.5920 1.6281 4.2417 1.3766 1.8748 2.2986 2.0551 3.6219 1.9589 1.6375 1.4512 2.0552 1.1054 2.8408 2.1651 2.0633 2.8031 2.5552 7.8524 1.8225 1.4588 1.8332 1.0563 1.3705 1.7181 4.0398 2.0446 4.1641 7.7271 3.7573 1.0449 1.0906 1.0994 1.0864 1.0892 1.0943 1.0993 1.0467 1.0757 1.1011
irintensity: 2.2176 2.0138 3.6503 2.0097 0.5812 3.4248 10.8997 11.2577 22.9400 49.3132 75.0852 12.1230 1.9468 50.3385 3.3751 84.1627 19.2242 141.1078 3.0071 3.6130 5.6345 4.5270 1.3296 12.4005 21.5822 86.9942 8.8616 1.6707 9.8707 3.1588 0.4685 2.2602 9.4513 98.4037 65.0158 32.9891 6.4980 38.3353 1.6037 22.6443 7.1212 19.8866 9.0769 22.1128 39.5127 25.5929 12.2160 59.6878 12.8524 5.2006 156.6238 88.2114 378.4263 35.3232 237.8047 304.7308 103.9620 34.0853 11.9694 9.4736 11.2363 19.7532 13.1024 109.2902 19.2095 30.4265
temp: 298.150 k
press: 1.00000 atm
elementType: 8 8 7 7 6 6 6 6 6 6 6 6 6 6 1 1 1 1 1 1 1 1 1 1
symmnumber: 1
zpe: 484906.6 jmol-1
zpe.correction: 0.184691 hartree
zpe.thermalcorrener: 0.197382 hartree
zpe.thermalcorrenthalpy: 0.198326 hartree
zpe.thermalcorrgfe: 0.145766 hartree
zpe.sumelectzpe: -646.018047 hartree
zpe.sumelectthermal: -646.005356 hartree
zpe.sumelectthermalent: -646.004412 hartree
zpe.sumelectthermalfe: -646.056972 hartree
dipole: 0.2247 6.4294 -0.5513
dipole: 6.4569
quadrupole: -66.4570 -83.7296 -84.8520
quadrupole: 8.9401 -1.8876 0.7780
quadrupole: 11.8892 -5.3834 -6.5058 8.9401 -1.8876 0.7780
hfenergy: -646.2027378 hartree
pointgroup: C01 [X(C10H10N2O2)]
dipole: -0.1573959 -2.5229028 0.2518971 debye
dipolederiv: -1.0678366 -0.1516881 0.0332943 -0.0927772 -0.4570472 0.0238738 0.0149944 0.0510146 -0.1847539 -0.9883124 -0.5865229 0.0493353 -0.6409276 -1.1828185 0.0710319 0.0616368 0.0445886 -0.3628029 -0.4804663 0.4828351 -0.1241172 0.2772851 -1.1291374 -0.0464652 -0.0450502 0.065807 -0.4858408 -1.6485075 -0.1302177 0.0028809 0.3523075 -0.139072 -0.119806 0.1268056 -0.129199 -0.5883523 0.4129085 0.0975967 0.0076805 -0.1084917 -0.2495269 0.0073202 -0.0054164 -0.1142746 0.0147667 -0.2451676 0.0043562 0.0693712 -0.5252788 1.3430869 -0.0397856 0.0979071 -0.1688817 0.0217948 0.1926694 0.1602856 -0.0397266 0.4962973 0.2847285 -0.0277391 -0.0599704 -0.0334616 0.1006463 1.4029774 -0.0692972 0.0922994 -0.2848937 -0.9848312 0.0591521 0.1832179 0.2327204 0.013877 -0.0409744 0.0473464 -0.0206998 -0.0699655 0.0647002 -0.0058178 0.0011592 0.0086203 -0.1743935 0.1051873 -0.0469573 0.0045233 -0.020697 0.0682825 -0.0234181 0.0178737 -0.0105145 -0.1525473 1.4235837 0.4360922 -0.0603337 0.8550086 1.7560008 -0.1065274 -0.1626959 -0.1431828 0.2422785 -0.0701959 0.0249386 0.0064234 0.2244346 0.0785498 -0.0169145 -0.009186 -0.0085278 -0.163759 -0.1247017 -0.0425636 -0.0013395 -0.2102157 -0.0420669 -0.0060517 0.0072388 -0.0138539 -0.1750848 0.4720586 -0.4929873 -0.0285674 -0.1385927 0.2412307 0.0815556 -0.057743 0.1402383 0.2486691 0.0844567 0.0912591 -0.010803 0.0363612 -0.1172638 0.01117 -0.0108073 0.0060197 0.1485265 0.1468649 0.0134606 0.1196935 -0.0113055 0.1661475 -0.0052054 0.1192995 0.0184754 0.274094 0.0939371 0.0052005 0.0013533 0.0443299 -0.034621 0.0163151 -0.0045551 0.01907 0.1713523 -0.0425805 -0.0996261 0.0085905 -0.1215573 -0.0108313 0.011614 0.008243 0.011953 0.1638464 -0.1106312 0.056808 0.0010791 0.055831 0.0745433 0.005401 0.0022313 0.0051414 0.1650937 0.0520785 -0.0539997 -0.0287209 0.0154576 -0.1606386 -0.1105026 -0.0001661 -0.1263223 0.0850686 -0.185716 0.1774519 -0.0698707 0.0243612 0.0554618 -0.0157934 -0.1127419 0.0121527 -0.0176509 0.0487333 0.0392164 0.0265667 -0.0532796 0.0491435 0.127212 0.0153982 0.0246139 -0.0124174 0.2344864 -0.0184336 -0.0079581 -0.1019828 0.1278808 0.0856784 -0.1135063 0.0975393 0.3203984 0.3351484 0.0554464 -0.0309543 -0.0017086 0.1980985 0.0237027 -0.074167 0.0102636 0.3471902 unknown
polarizability: 209.8828518|10.5738208|155.642603|-2.0117024|-5.3969296|57.6453344 unknown
InChI: InChI=1S/C10H10N2O2/c1-12-9-6-4-2-3-5-7(6)14-10(13)8(9)11/h2-5,12H,11H2,1H3
charge 0 multiplicity 1
24 atoms
O  -0.082773 1.890934 -0.193843
O  2.130829 2.530587 -0.234922
N  1.105786 -2.192422 0.215822
N  3.062497 -0.012876 0.16162
C  -0.688488 -0.48815 0.052325
C  0.728707 -0.845203 0.088212
C  -1.05373 0.8861 -0.059271
C  1.686677 0.179794 0.033493
C  -1.754082 -1.435425 0.119456
C  -2.395659 1.312728 -0.069645
C  1.308114 1.583249 -0.151937
C  -3.098477 -1.023227 0.111569
C  -3.424466 0.355325 0.023919
C  2.183589 -2.826381 -0.566613
H  -1.532941 -2.508507 0.156025
H  0.408795 -2.822701 0.608943
H  -2.605165 2.382773 -0.157261
H  -3.896683 -1.7710 0.164077
H  -4.471023 0.676331 0.018412
H  1.829885 -3.794251 -0.966294
H  3.099215 -3.027001 0.027455
H  2.459621 -2.188809 -1.421531
H  3.428593 -0.863635 0.576539
H  3.640479 0.827467 0.136752
