program: Gaussian 09
title: 000043038
version: EM64L-G09RevD.01
frameworkgroup: C1[X(C17H13NO6)]
method: RPBEPBE
basis: SDD
operation: Freq
keyword: #p
keyword: freq=noraman
keyword: PBEPBE/SDD
title: #p freq=noraman PBEPBE/SDD
converged: YES YES NO NO
title: Mulliken charges:
elementType: O O O O O O N C C C C C C C C C C C C C C C C C H H H H H H H H H H H H H
charge: -0.245398 -0.264804 -0.258037 -0.265829 -0.221907 -0.219150 0.026001 -0.398682 0.588463 0.370363 0.415839 0.141260 -0.471145 -0.450042 -0.423274 0.198536 0.168288 -0.340701 -0.523288 -0.359953 0.318094 -0.337141 -0.203842 -0.536095 0.281935 0.301937 0.264481 0.238296 0.255492 0.268233 0.256804 0.250058 0.242749 0.237914 0.222238 0.249962 0.222347
chargesum: 0.00000
title: Mulliken charges with hydrogens summed into heavy atoms:
elementType: O O O O O O N C C C C C C C C C C C C C C C C C
charge: -0.245398 -0.264804 -0.258037 -0.265829 -0.221907 -0.219150 0.026001 -0.116748 0.588463 0.370363 0.415839 0.141260 -0.169208 -0.185561 -0.184978 0.198536 0.168288 -0.085209 -0.255055 -0.103149 0.318094 -0.087083 0.276821 0.158451
polarizability: 3.03046398e+02 -4.17023518e+01 2.27531680e+02 -1.22141545e+01 -8.33352660e+00 1.85858953e+02
1716.lowfreq: -10.8881 -5.3219 -0.0006 0.0006 0.0007 4.0876 19.5332 21.9677 49.3386
frequency: 19.4703 21.8733 49.3271 62.1887 70.1563 76.5760 82.6011 125.0307 133.0786 140.0853 190.4684 211.7533 233.9320 235.8314 256.3023 281.8708 304.7349 340.7756 345.4816 373.1264 398.4380 407.4655 419.5576 431.5173 446.9070 515.8846 525.7747 557.7449 576.2944 590.8045 600.6346 616.4973 632.7920 677.0197 686.9103 693.3522 716.2279 727.4082 737.5767 762.6073 769.1784 792.4315 815.3902 820.1523 833.5945 857.7374 876.7732 886.3968 916.5387 920.3762 928.1268 936.1669 940.1680 948.8935 975.6220 1001.4768 1046.5263 1061.0138 1069.0309 1112.7806 1120.5756 1124.9109 1130.9331 1147.9978 1166.1468 1179.6395 1188.6798 1199.9971 1245.4152 1253.0005 1259.0285 1270.9168 1292.1646 1309.8099 1336.4534 1357.9329 1364.4614 1393.2981 1412.8067 1431.3810 1444.5945 1447.6928 1468.6846 1469.2706 1473.9083 1475.5250 1486.0533 1558.2269 1609.3466 1625.5507 1627.1405 1634.0092 2959.9825 3007.6132 3048.6835 3084.8592 3108.9536 3128.6507 3145.2743 3156.3353 3157.9857 3158.6018 3177.1038 3178.2404 3184.8169
redmass: 5.7914 5.6838 6.5525 6.0471 4.6195 3.0794 4.4963 6.3891 7.4033 5.8110 4.9868 4.6739 1.6509 4.7543 3.1235 6.7999 6.8181 6.1249 5.4528 6.3319 5.6182 4.4384 5.2055 3.9711 3.2226 5.1872 6.5223 6.0410 4.7991 5.2500 5.8223 5.3729 6.0687 9.2441 6.8912 6.5613 7.6194 4.0730 3.8912 6.1465 6.1834 4.7490 1.4986 1.6317 8.4305 3.6961 1.5602 1.7379 4.7773 5.0107 4.7113 1.3758 1.3822 1.4954 5.1160 3.5845 2.8868 3.3993 1.4904 1.2576 1.6354 1.0877 1.4207 1.5216 2.1609 1.6824 1.7215 5.2500 2.3944 2.0024 1.4800 2.9348 1.5626 1.7249 3.5490 4.0289 1.3128 8.8704 3.2503 1.5404 4.2598 2.3556 1.0740 2.6946 1.1711 1.7541 1.4743 6.1719 7.7863 7.5915 8.3351 7.9624 1.0331 1.0591 1.1042 1.0863 1.1126 1.0992 1.0903 1.0926 1.0883 1.0918 1.0923 1.0963 1.0958
irintensity: 0.3271 0.9301 1.0837 0.0829 3.5905 8.9110 4.5757 0.3595 0.5478 6.7440 2.2530 3.1981 0.0446 5.4975 2.4365 0.4426 4.5729 4.7928 2.2811 0.4771 2.3759 7.6736 4.7100 4.8488 6.9985 5.5673 26.6977 5.7271 2.1583 8.8129 3.6754 1.8645 10.5669 0.5790 13.5436 18.4264 7.7882 6.8212 0.8030 11.4314 15.5962 4.4434 32.8300 61.4437 14.7921 70.2535 5.3837 19.0613 1.8783 15.2805 41.3483 0.9256 0.5532 45.0797 116.1798 50.8830 69.2354 28.6146 6.2201 0.1119 36.4690 0.0402 3.5025 7.6153 95.4106 3.2100 28.0416 888.3960 168.9779 120.1461 15.0475 10.3034 37.0516 30.0378 50.7436 106.0314 10.1833 7.0679 12.4471 49.8891 68.4596 33.0424 15.2758 110.4692 27.0727 63.9769 45.4849 188.2695 5.5462 41.8482 9.5981 90.8467 78.4705 121.1478 46.2558 2.1292 25.7690 24.1718 5.0479 2.7008 6.4820 0.1420 1.5374 7.0771 4.2244
temp: 298.150 k
press: 1.00000 atm
elementType: 8 8 8 8 8 8 7 6 6 6 6 6 6 6 6 6 6 6 6 6 6 6 6 6 1 1 1 1 1 1 1 1 1 1 1 1 1
symmnumber: 1
zpe: 704523.3 jmol-1
zpe.correction: 0.268339 hartree
zpe.thermalcorrener: 0.288498 hartree
zpe.thermalcorrenthalpy: 0.289442 hartree
zpe.thermalcorrgfe: 0.217417 hartree
zpe.sumelectzpe: -1159.863323 hartree
zpe.sumelectthermal: -1159.843164 hartree
zpe.sumelectthermalent: -1159.842220 hartree
zpe.sumelectthermalfe: -1159.914245 hartree
dipole: 3.0986 -6.2300 1.4733
dipole: 7.1123
quadrupole: -114.6088 -147.0108 -135.3486
quadrupole: -0.1033 4.1659 7.2211
quadrupole: 17.7140 -14.6881 -3.0259 -0.1033 4.1659 7.2211
hfenergy: -1160.1316622 hartree
pointgroup: C01 [X(C17H13N1O6)]
dipole: 1.1491683 -2.4934035 0.5405666 debye
polarizability: 300.8423906|-43.4330758|230.1345005|-12.6587786|-7.4136546|185.4601401 unknown
InChI: InChI=1S/C17H13NO6/c1-21-12-3-5-14-11(6-12)7-13(18(19)20)17(24-14)10-2-4-15-16(8-10)23-9-22-15/h2-8,17H,9H2,1H3
charge 0 multiplicity 1
37 atoms
O  0.682507 0.82189 1.819857
O  -2.670005 -2.133184 -1.723378
O  -4.446141 -2.398058 -0.131071
O  4.994617 -1.444882 -1.001567
O  -0.142839 3.936154 -1.762644
O  -1.635816 3.70677 -0.039728
N  -0.571697 3.344217 -0.693255
C  -0.431029 1.499106 1.037502
C  -1.529954 0.496206 0.718827
C  0.162961 2.194981 -0.171696
C  2.069705 0.673192 -0.218794
C  1.713552 0.217779 1.093075
C  1.314638 1.77573 -0.782848
C  -1.48599 -0.295755 -0.467798
C  -2.582184 0.330284 1.653741
C  -2.510674 -1.222368 -0.648361
C  -3.555254 -1.382502 0.288484
C  -3.618995 -0.618393 1.456411
C  3.17903 0.08819 -0.879497
C  2.470815 -0.78638 1.723306
C  3.924354 -0.932098 -0.253272
C  3.571331 -1.365835 1.055178
C  -3.993248 -2.772788 -1.500116
C  5.810469 -2.49702 -0.389808
H  -0.809835 2.241429 1.7571
H  1.665165 2.295422 -1.681009
H  -0.693439 -0.180061 -1.211091
H  -2.599496 0.957107 2.551766
H  -4.432254 -0.742032 2.175256
H  3.470974 0.420268 -1.880989
H  2.19247 -1.108459 2.730634
H  4.141937 -2.151705 1.558487
H  -3.877337 -3.866327 -1.551628
H  -4.716251 -2.376372 -2.236839
H  6.297362 -2.141382 0.539217
H  6.577418 -2.735296 -1.140824
H  5.208034 -3.40083 -0.173728
